program: Gaussian 09
title: 000201974
version: EM64L-G09RevD.01
frameworkgroup: C1[X(C14H19NO2)]
method: RPBEPBE
basis: SDD
operation: Freq
keyword: #p
keyword: freq=noraman
keyword: PBEPBE/SDD
title: #p freq=noraman PBEPBE/SDD
converged: YES YES NO NO
title: Mulliken charges:
elementType: O O N C C C C C C C C C C C C C C H H H H H H H H H H H H H H H H H H H
charge: -0.285889 -0.278264 -0.637626 0.395672 0.407454 0.005625 -0.522860 -0.521086 -0.565919 -0.598230 0.344462 -0.685443 -0.688024 0.124344 -0.342864 -0.042862 -0.556187 0.203331 0.210360 0.216592 0.206712 0.217590 0.284468 0.253577 0.213473 0.213081 0.222043 0.213399 0.244805 0.205887 0.211954 0.235934 0.319364 0.334393 0.222245 0.218488
chargesum: 0.00000
title: Mulliken charges with hydrogens summed into heavy atoms:
elementType: O O N C C C C C C C C C C C C C C
charge: -0.285889 -0.278264 0.016131 0.395672 0.407454 0.005625 -0.109169 -0.097783 -0.348329 -0.313762 0.344462 -0.005312 -0.007777 0.124344 0.074977 0.193073 -0.115454
polarizability: 2.32905453e+02 -4.84452286e+00 1.75263387e+02 2.52775550e+00 1.85325232e+00 1.04366561e+02
1716.lowfreq: -7.5009 -6.2327 -0.0004 -0.0002 -0.0001 5.9506 19.7927 34.9067 38.1468
frequency: 19.5853 34.8737 38.1159 43.4987 51.0228 72.0427 89.7800 119.6159 150.5188 158.9441 168.7055 201.5717 224.0666 241.3301 250.5834 284.4529 297.9982 311.9919 367.2573 385.0963 408.6245 439.5537 471.5034 523.5413 528.0721 544.7847 561.8137 593.2550 614.2445 617.0685 629.1591 730.4344 746.7132 782.1504 789.3649 801.0142 881.9692 885.4367 891.0707 905.6062 939.1030 945.1163 958.9104 971.7780 982.1501 1011.5700 1019.0208 1047.9984 1054.0428 1065.9250 1066.9589 1087.6545 1117.1215 1142.3135 1170.4235 1206.9587 1233.5538 1248.0117 1264.4591 1268.9738 1282.7508 1308.7168 1313.6444 1338.4713 1364.0722 1376.8511 1383.1418 1385.3495 1419.8714 1431.1883 1454.0337 1469.8371 1471.9528 1473.2863 1474.3320 1482.1442 1489.5895 1492.1775 1567.1724 1595.2196 1604.2148 1631.7409 1664.8854 2950.4096 2983.3087 2983.6332 2993.2622 2999.7421 3011.1593 3045.1868 3049.6686 3078.8680 3080.1994 3091.1679 3094.8393 3097.6719 3109.6718 3118.0412 3145.1667 3201.6212 3530.2334 3683.9684
redmass: 3.5260 4.6409 4.4297 2.6049 2.5256 2.3040 3.4430 3.1150 4.5569 3.1145 3.1560 1.2743 1.3465 2.6214 2.9468 3.0248 2.1714 2.9779 3.2927 3.6034 4.0616 2.8177 1.2486 3.1535 2.6443 3.2667 2.9918 1.9005 3.1742 1.7607 2.9441 2.7145 5.1761 2.1177 1.2203 2.0215 3.2612 2.6821 1.6831 2.7761 1.7373 1.5632 1.4191 1.7459 2.5221 1.2333 2.7151 2.0951 1.7653 1.8470 1.7561 1.6783 2.1709 1.5857 2.4085 1.2874 1.3621 1.3500 1.4982 1.6214 1.2463 1.4025 1.6316 1.3333 3.9455 2.7956 1.6006 1.2515 4.1017 1.2238 1.9722 1.0528 1.0531 1.0925 1.2977 1.0806 1.0779 1.0795 3.5713 2.9091 5.8583 2.2589 4.7794 1.0578 1.0350 1.0351 1.0601 1.0597 1.1040 1.1005 1.1014 1.1001 1.0999 1.0606 1.1014 1.1009 1.0907 1.0946 1.0917 1.1143 1.0447 1.1039
irintensity: 0.2045 13.6371 0.9650 0.2592 0.0889 0.5594 1.2040 0.8657 0.4599 2.0993 7.3777 0.0371 2.8873 2.0006 1.4833 3.2548 0.7621 3.8884 3.3504 7.9353 2.4468 3.4407 100.0642 36.8629 33.0225 41.5487 3.8525 37.3264 11.1829 18.9399 17.5383 2.3850 31.6847 2.7147 1.9237 17.5177 11.4938 28.9842 15.5923 21.5034 82.4368 57.0067 53.3996 12.7714 1.8505 14.5951 2.2416 0.6251 2.0584 5.7849 10.9812 8.9817 96.6441 0.9444 97.7810 1.1790 7.6931 27.5393 7.1899 1.0077 0.4697 0.9402 28.4958 75.5417 229.5825 11.0952 4.3381 38.8097 17.0588 22.3981 5.5020 1.2308 12.0439 6.9118 4.9736 17.2851 8.6686 13.1271 131.9805 63.0139 21.7062 213.3726 3.2528 32.8902 24.7379 57.4280 35.4607 33.5608 33.7118 11.3514 11.8569 48.4604 53.8893 12.3147 32.7095 24.7550 22.6432 7.8006 1.3925 24.8103 36.8057 29.4569
temp: 298.150 k
press: 1.00000 atm
elementType: 8 8 7 6 6 6 6 6 6 6 6 6 6 6 6 6 6 1 1 1 1 1 1 1 1 1 1 1 1 1 1 1 1 1 1 1
symmnumber: 1
zpe: 785832.5 jmol-1
zpe.correction: 0.299308 hartree
zpe.thermalcorrener: 0.318165 hartree
zpe.thermalcorrenthalpy: 0.319110 hartree
zpe.thermalcorrgfe: 0.249963 hartree
zpe.sumelectzpe: -748.794090 hartree
zpe.sumelectthermal: -748.775233 hartree
zpe.sumelectthermalent: -748.774288 hartree
zpe.sumelectthermalfe: -748.843435 hartree
dipole: 2.2769 -3.2094 0.1479
dipole: 3.9378
quadrupole: -100.3684 -93.8513 -106.3069
quadrupole: 17.0871 -9.5459 2.8295
quadrupole: -0.1929 6.3242 -6.1313 17.0871 -9.5459 2.8295
hfenergy: -749.0933979 hartree
pointgroup: C01 [X(C14H19N1O2)]
dipole: -0.9193339 -1.2404892 -0.1272467 debye
polarizability: 232.7339101|3.4927789|175.1294766|7.2460191|0.2502491|104.6720141 unknown
InChI: InChI=1S/C14H19NO2/c1-4-7-17-13-10(5-2)8-12(14(15)16)9-11(13)6-3/h4,8-9H,1,5-7,15H2,2-3H3
charge 0 multiplicity 1
36 atoms
O  -1.951393 0.074594 -0.319569
O  4.324914 0.957627 1.004778
N  4.42399 -1.250434 0.322267
C  0.081735 -1.254452 -0.009659
C  0.181329 1.233178 0.061809
C  -0.549213 0.018528 -0.065449
C  -0.709084 -2.535712 -0.227759
C  -0.497568 2.584622 -0.102566
C  1.480008 -1.292228 0.200099
C  1.574408 1.14655 0.27653
C  2.236745 -0.10238 0.344595
C  -1.00904 -2.786775 -1.730101
C  -0.732606 2.933853 -1.597205
C  3.723757 -0.081024 0.586723
C  -2.794123 0.121026 0.913414
C  -4.210772 0.391277 0.485656
C  -5.276424 -0.353941 0.867713
H  -0.141422 -3.391583 0.185014
H  -1.671291 -2.494759 0.314823
H  0.129717 3.366091 0.365097
H  -1.473373 2.598682 0.416804
H  1.956694 -2.277508 0.283005
H  2.177537 2.053263 0.397356
H  -1.610216 -1.957775 -2.140754
H  -1.575667 -3.726493 -1.863781
H  -0.073964 -2.861044 -2.314472
H  0.223852 2.962971 -2.149308
H  -1.218058 3.92209 -1.696248
H  -1.382606 2.177122 -2.069737
H  -2.71238 -0.837658 1.463576
H  -2.414078 0.931832 1.570624
H  -4.346509 1.266373 -0.164672
H  3.998051 -2.066436 -0.110259
H  5.428643 -1.246977 0.493271
H  -6.295172 -0.096877 0.55823
H  -5.162821 -1.240325 1.504453
