program: Gaussian 09
title: 000202032
version: EM64L-G09RevD.01
frameworkgroup: C1[X(C23H32NO)]
method: RPBEPBE
basis: SDD
operation: Freq
keyword: #p
keyword: freq=noraman
keyword: PBEPBE/SDD
title: #p freq=noraman PBEPBE/SDD
converged: NO YES NO NO
title: Mulliken charges:
elementType: O N C C C C C C C C C C C C C C C C C C C C C C C H H H H H H H H H H H H H H H H H H H H H H H H H H H H H H H H
charge: -0.328734 -0.127845 -0.349950 -0.337555 0.033211 -0.293378 -0.450880 -0.442162 -0.399030 -0.381784 -0.779208 -0.722580 0.224402 0.367875 -0.341947 -0.690058 -0.405728 -0.231899 -0.235139 0.514058 -0.413678 -0.453308 -0.248849 -0.253248 -0.257732 0.250088 0.269398 0.270974 0.240024 0.307626 0.296071 0.246052 0.235422 0.252122 0.252153 0.236289 0.256395 0.210728 0.216246 0.259050 0.238735 0.288487 0.235543 0.278748 0.227688 0.257017 0.227592 0.251568 0.225082 0.250820 0.243833 0.246750 0.261558 0.242346 0.244460 0.240890 0.245390
chargesum: 1.00000
title: Mulliken charges with hydrogens summed into heavy atoms:
elementType: O N C C C C C C C C C C C C C C C C C C C C C C C
charge: -0.328734 -0.127845 0.169537 0.173442 0.340837 0.248745 0.036664 0.046280 0.068093 0.093512 -0.016443 0.040873 0.224402 0.367875 -0.114355 -0.213408 -0.154908 0.011934 0.011611 0.514058 -0.152120 -0.210961 -0.004388 -0.012358 -0.012342
polarizability: 2.82048497e+02 -3.09632242e+01 2.41408952e+02 -2.58048555e-01 8.39354773e+00 2.06879861e+02
1716.lowfreq: -5.3941 -0.0008 -0.0006 0.0005 3.7180 10.9232 27.7621 34.7092 39.1889
frequency: 26.4513 34.0584 39.1231 51.4552 62.1090 62.6910 74.7438 103.5788 120.9652 129.2271 155.4853 170.1210 194.5362 202.4169 215.0928 226.9797 240.2219 267.6169 282.1165 299.7196 307.9317 313.8828 334.6981 357.4389 392.3543 399.1412 405.9564 416.6718 440.8949 453.1240 462.2008 474.3030 487.7648 514.6827 533.3016 552.4554 563.5690 601.1275 614.1837 619.9859 642.4964 705.3481 727.4284 736.2044 757.0612 759.5011 777.0587 783.9568 804.7893 807.9124 828.2294 838.8709 864.1556 867.5280 868.7003 881.1973 888.7445 900.6695 907.0399 929.3823 938.4632 946.2748 957.2974 983.0128 984.9563 989.1142 992.9714 993.9591 1003.8748 1007.8227 1025.4478 1026.0473 1042.3542 1048.9309 1076.2605 1079.8123 1092.7488 1098.7680 1106.9734 1112.6247 1130.6287 1165.7489 1168.0772 1169.1034 1172.9488 1174.8188 1176.9772 1189.0696 1191.1303 1192.6941 1198.3391 1223.5677 1240.5192 1262.8044 1269.2933 1282.1988 1294.3691 1297.1243 1306.5347 1317.5492 1331.0840 1338.9052 1345.7727 1351.6472 1353.3467 1367.9177 1370.5826 1376.2825 1378.2028 1382.4646 1391.9556 1408.8063 1418.0177 1435.7367 1438.8720 1455.6789 1457.8266 1461.4501 1467.5777 1468.6291 1475.1175 1477.2747 1481.4127 1482.8833 1483.7784 1488.4675 1490.0423 1495.5156 1500.3022 1586.2636 1591.1776 1607.4186 1610.5798 2960.7234 2980.9824 2991.7192 3003.8608 3004.6626 3008.3151 3010.3943 3027.3849 3033.6025 3036.1335 3047.3715 3050.6311 3057.9002 3061.0435 3065.1992 3076.2509 3090.4442 3094.8497 3107.3380 3108.6558 3109.6582 3112.2845 3120.1174 3123.0903 3132.1116 3133.7467 3135.4301 3136.6894 3144.4597 3154.8473 3163.7691 3174.8160
redmass: 4.0904 3.4647 4.1446 4.2971 4.3301 4.1522 4.3177 2.7088 2.8145 2.1950 3.4687 2.8077 3.5387 2.7474 2.7136 1.4851 1.4531 2.6558 2.7233 2.0229 3.1137 2.4783 2.5032 2.4167 1.8895 2.8982 2.8938 3.5535 3.0104 3.4264 3.0219 3.1027 2.9179 2.5208 2.9500 3.4299 2.9984 4.4114 5.3464 5.5452 2.8071 2.7784 2.9160 1.9299 1.7745 1.7169 1.7619 1.5522 2.0441 3.1391 2.0968 3.5063 1.9905 1.4813 1.4019 2.0618 1.7580 1.7928 1.5671 1.5945 1.5691 1.5073 1.6293 5.4624 1.7956 2.5924 1.3435 1.8744 1.3968 2.2576 2.2600 2.6216 2.1733 1.9996 1.8007 1.6153 2.5233 2.5432 1.6475 1.9879 1.9098 1.8320 2.2389 2.1895 1.0689 1.4278 1.0846 1.1490 1.2575 1.4139 2.1055 2.0620 1.3012 1.2547 1.4463 1.1801 1.2598 1.2516 1.5207 1.2102 1.2071 1.3661 1.3512 1.4410 1.3773 1.2924 1.3417 2.7412 3.7169 1.9549 1.4124 1.2078 1.1771 2.0249 2.1754 1.1358 1.1382 1.1053 1.0760 1.0842 1.0745 1.0945 1.8210 1.7780 1.0919 1.2393 1.0706 1.0618 1.0839 6.0436 6.2716 6.4233 6.4531 1.0628 1.0597 1.0667 1.0389 1.0376 1.0616 1.0617 1.1000 1.0697 1.0878 1.0678 1.0862 1.0733 1.0855 1.0941 1.1007 1.0971 1.0987 1.1050 1.0884 1.1010 1.1006 1.1034 1.0865 1.0881 1.1045 1.0909 1.0895 1.0956 1.0932 1.1010 1.1006
irintensity: 0.0531 0.3131 1.5345 0.2227 7.4639 0.1334 2.5587 2.7636 0.8098 0.7294 1.3128 1.3844 0.7316 0.1312 2.7976 4.4260 0.6669 0.0884 6.7224 0.7840 0.9500 0.3440 1.7799 0.9874 0.1307 0.3534 0.1617 0.8554 3.5919 2.2692 0.5158 6.5218 3.0902 3.6021 2.9005 5.0655 1.4370 1.5310 2.5442 3.2711 1.5568 13.6235 16.4827 60.4355 58.4970 61.1152 68.2095 1.0048 5.9414 6.5650 0.4155 2.5705 15.3647 8.0605 3.2186 3.6897 6.7529 5.9960 3.0992 10.5770 6.8564 1.5046 4.6226 49.4272 1.2347 0.5349 0.4104 10.5844 0.1684 11.7132 1.7131 28.1756 15.2479 4.2564 22.9163 13.1861 18.0335 71.7682 2.9180 1.1175 7.6588 3.9184 20.9130 47.3767 1.0563 1.4482 0.6256 0.7195 1.9252 0.8494 23.8479 17.1706 16.5423 1.7771 1.7472 4.6010 2.1885 3.8849 1.0865 5.1592 0.7669 0.5720 0.3722 0.7246 0.9527 2.7284 1.4203 2.0144 0.6135 2.8328 1.6778 23.3292 34.0280 16.1349 14.4199 27.4749 6.4254 20.5373 4.5983 37.4853 23.2176 8.5978 22.2059 76.2584 5.6878 4.4526 6.4519 33.4219 17.6005 1.9530 12.7675 3.2011 12.5210 44.3819 17.8831 18.3398 12.6894 9.7023 13.1259 13.0984 10.7894 11.6364 12.2947 9.8714 0.3549 22.2064 5.4807 11.2692 30.7541 10.7673 4.4127 15.4100 10.6057 10.3348 0.5475 18.0834 2.4975 8.4074 9.3447 4.8666 5.0211 23.1071 13.4431 14.1860 13.3879
temp: 298.150 k
press: 1.00000 atm
elementType: 8 7 6 6 6 6 6 6 6 6 6 6 6 6 6 6 6 6 6 6 6 6 6 6 6 1 1 1 1 1 1 1 1 1 1 1 1 1 1 1 1 1 1 1 1 1 1 1 1 1 1 1 1 1 1 1 1
symmnumber: 1
zpe: 1313746.9 jmol-1
zpe.correction: 0.500380 hartree
zpe.thermalcorrener: 0.524444 hartree
zpe.thermalcorrenthalpy: 0.525388 hartree
zpe.thermalcorrgfe: 0.446797 hartree
zpe.sumelectzpe: -1023.494235 hartree
zpe.sumelectthermal: -1023.470171 hartree
zpe.sumelectthermalent: -1023.469226 hartree
zpe.sumelectthermalfe: -1023.547817 hartree
dipole: -8.5750 -1.7150 -1.3691
dipole: 8.8514
quadrupole: -89.3206 -131.5026 -133.8926
quadrupole: -0.8266 -0.3475 3.0898
quadrupole: 28.9180 -13.2640 -15.6540 -0.8266 -0.3475 3.0898
hfenergy: -1023.9946144 hartree
pointgroup: C01 [X(C23H32N1O1)]
dipole: -3.3622389 0.7837995 -0.456176 debye
polarizability: 252.4396933|-35.8606051|269.7578611|0.4088732|12.2031141|208.1397548 unknown
InChI: InChI=1S/C23H32NO/c1-3-24(16-10-5-11-17-24)20(2)19-25-23-15-9-8-14-22(23)18-21-12-6-4-7-13-21/h4,6-9,12-15,20H,3,5,10-11,16-19H2,1-2H3
charge 1 multiplicity 1
57 atoms
O  -0.023123 -1.304039 0.209117
N  -2.678272 0.536725 0.0582
C  -3.793347 -0.037317 -0.848223
C  -3.069382 1.978035 0.46472
C  -1.294716 0.592076 -0.719933
C  -2.54787 -0.360494 1.324732
C  -5.203971 0.05729 -0.233705
C  -4.447529 2.057272 1.140683
C  -5.548702 1.495329 0.213231
C  -0.69352 -0.801259 -0.998661
C  -1.377654 1.364147 -2.05441
C  -1.662509 0.201501 2.440943
C  1.032398 -2.246601 -0.014465
C  2.27699 -1.977126 0.613573
C  0.816092 -3.409517 -0.782691
C  2.499748 -0.714423 1.434418
C  3.303909 -2.939676 0.453006
C  1.862626 -4.347014 -0.933958
C  3.107877 -4.113583 -0.309932
C  2.310949 0.604353 0.680233
C  2.683284 0.738878 -0.682543
C  1.815481 1.747461 1.360073
C  2.555638 1.979696 -1.349156
C  1.687146 2.99107 0.698253
C  2.052817 3.11135 -0.663595
H  -3.52728 -1.084074 -1.069715
H  -3.757835 0.542804 -1.784787
H  -2.259249 2.361606 1.104417
H  -3.087882 2.572581 -0.46215
H  -0.61652 1.122246 -0.028316
H  -2.139568 -1.321187 0.976346
H  -3.571638 -0.525529 1.691418
H  -5.319754 -0.647663 0.609778
H  -5.912527 -0.283405 -1.011341
H  -4.640212 3.122236 1.365924
H  -4.447753 1.531227 2.113194
H  -6.525129 1.506338 0.727266
H  -5.649395 2.149224 -0.675991
H  -1.458524 -1.521026 -1.357708
H  0.056177 -0.683114 -1.803314
H  -1.832442 0.769053 -2.865583
H  -0.341743 1.598418 -2.354025
H  -1.902779 2.329664 -1.988431
H  -0.640222 0.416271 2.094345
H  -2.089796 1.094462 2.928036
H  -1.578239 -0.581601 3.215429
H  -0.160415 -3.598685 -1.242658
H  3.531387 -0.743155 1.836865
H  1.829511 -0.715163 2.316055
H  4.275169 -2.75929 0.928356
H  1.700482 -5.25407 -1.525054
H  3.921355 -4.837739 -0.417483
H  3.093406 -0.126428 -1.216669
H  1.562188 1.672153 2.425933
H  2.873924 2.070792 -2.394043
H  1.329797 3.868452 1.249441
H  1.976645 4.077968 -1.173349
