program: Gaussian 09
title: 000201943
version: EM64L-G09RevD.01
frameworkgroup: C1[X(C14H22N3O3)]
method: RPBEPBE
basis: SDD
operation: Freq
keyword: #p
keyword: freq=noraman
keyword: PBEPBE/SDD
title: #p freq=noraman PBEPBE/SDD
converged: YES YES NO NO
title: Mulliken charges:
elementType: O O O N N N C C C C C C C C C C C C C C H H H H H H H H H H H H H H H H H H H H H H
charge: -0.295846 -0.179175 -0.182228 -0.093866 -0.403042 0.032410 -0.341807 -0.306861 -0.308457 -0.630088 -0.404868 -0.697473 -0.692504 0.186528 0.297282 -0.327568 -0.316469 -0.351164 -0.363550 0.396072 0.264403 0.315838 0.259831 0.269790 0.257946 0.265234 0.332847 0.266327 0.255884 0.261497 0.262208 0.268078 0.252295 0.244307 0.266146 0.257317 0.243403 0.332623 0.283723 0.219540 0.302634 0.300802
chargesum: 1.00000
title: Mulliken charges with hydrogens summed into heavy atoms:
elementType: O O O N N N C C C C C C C C C C C C C C
charge: -0.295846 -0.179175 -0.182228 -0.093866 -0.070418 0.032410 0.238434 0.222760 0.214723 0.224970 0.118836 0.067206 0.074363 0.186528 0.297282 -0.043845 -0.096929 -0.048530 -0.062748 0.396072
polarizability: 2.77886265e+02 8.78070390e+00 1.72383258e+02 -9.25046505e+00 1.75099125e+01 1.17865793e+02
1716.lowfreq: -8.9683 0.0003 0.0005 0.0006 4.2198 12.0243 21.4602 27.3227 37.2382
frequency: 21.2488 27.2670 37.0366 58.3969 62.0745 83.8948 96.4943 106.2504 121.7534 129.0277 184.0757 208.8785 225.0016 235.8050 245.9430 262.4175 272.4021 274.3941 299.6358 322.3323 360.3120 374.8557 380.9047 405.4851 429.5418 443.5707 474.5420 487.8234 499.6829 517.7920 530.6419 550.3205 623.9807 655.8348 669.6390 692.1018 700.1485 752.5542 768.0181 785.7642 792.9978 804.5830 830.6055 843.4241 852.1965 886.4782 902.8964 938.8159 987.2180 1001.3228 1011.3309 1012.9220 1023.5334 1026.4908 1037.7830 1070.7310 1082.8871 1091.6302 1112.2453 1117.2003 1126.6469 1148.4043 1169.7327 1186.5245 1189.9933 1199.9828 1213.8776 1258.1498 1286.1059 1292.6598 1302.3371 1311.8422 1322.1939 1349.7107 1367.1824 1373.6485 1377.4297 1395.3410 1403.2683 1409.8419 1411.9684 1420.9557 1438.9103 1449.8622 1458.7274 1463.7336 1468.2207 1469.6044 1480.3098 1482.5204 1485.5093 1491.6542 1492.1734 1497.5386 1505.0938 1562.3344 1605.3486 1610.3650 3008.9841 3009.6139 3018.3926 3022.3363 3025.5322 3028.6524 3038.5109 3086.4371 3091.2298 3095.5036 3097.5371 3099.9757 3119.5766 3123.0294 3134.6947 3137.5520 3139.4024 3149.9507 3168.0464 3185.6877 3189.1857 3576.0939
redmass: 4.4522 5.6136 4.5476 4.7301 5.9180 2.5731 3.0807 4.5792 2.5545 3.1394 2.3350 3.4159 2.2158 1.8752 2.8282 1.3100 1.1922 4.3357 4.1863 2.7598 3.0733 2.4452 3.1508 2.7744 2.6177 4.1399 4.1244 7.2235 2.7640 3.3666 1.5256 2.7873 7.0156 5.2298 3.9459 4.0760 4.4570 1.9158 4.8693 4.8967 1.3052 1.2181 3.0107 1.4087 2.1960 1.5737 2.3267 2.9187 1.3779 3.5186 1.6637 1.7590 2.5570 3.0191 2.9166 1.9299 1.5911 3.1024 1.5435 1.6222 1.6533 3.0242 1.7041 1.4710 1.7628 1.7904 4.6380 1.4834 1.6406 1.1402 1.3231 1.2410 1.1474 1.2206 1.2670 6.0764 1.3094 1.2486 8.1366 4.2704 1.2025 1.1888 1.1527 1.2030 1.1014 1.1664 1.1376 1.4382 1.0620 1.0541 1.0557 1.0815 1.1781 1.7230 1.0577 5.8856 7.3939 6.2686 1.0376 1.0377 1.0602 1.0595 1.0366 1.0605 1.0641 1.1049 1.1016 1.1011 1.0979 1.0992 1.1028 1.1031 1.0903 1.1023 1.1044 1.1054 1.0899 1.0947 1.0967 1.0790
irintensity: 0.2624 0.0450 1.7928 2.2380 0.4826 1.9904 4.2435 8.8986 2.2217 9.1222 1.8528 1.0498 2.6289 0.1554 0.8530 0.0631 2.7240 0.6051 13.7468 0.0662 2.7143 2.2781 1.2138 0.9701 0.2289 8.5444 2.3078 12.2428 3.4861 27.7549 70.1925 3.4020 0.7898 8.7938 0.7614 42.5068 16.6333 1.4736 9.4168 74.5981 15.2992 11.0343 4.4132 9.2731 11.0964 39.4119 4.6611 17.6797 2.7743 9.3643 12.5982 19.5422 16.0005 13.0854 11.9707 1.5662 1.0929 12.4628 6.6143 17.2765 8.3586 11.5400 3.4262 33.2478 3.2605 2.7641 248.4812 56.4108 69.6257 2.8461 16.2562 29.9409 25.3324 17.5695 1.7714 70.0353 1.7926 21.9666 1.0017 47.7825 22.0356 38.1599 10.9000 83.3110 6.9889 46.2714 27.1587 51.2624 71.9715 0.5699 32.1128 4.4226 16.9460 165.8911 74.9355 143.7358 22.5488 5.0200 2.8734 4.3799 17.3333 11.8856 22.5404 14.7942 10.4567 1.5155 5.5359 4.6261 6.8664 5.2146 24.1473 15.2342 13.3578 8.6094 18.0774 1.5044 1.5955 3.5273 3.4998 26.6364
temp: 298.150 k
press: 1.00000 atm
elementType: 8 8 8 7 7 7 6 6 6 6 6 6 6 6 6 6 6 6 6 6 1 1 1 1 1 1 1 1 1 1 1 1 1 1 1 1 1 1 1 1 1 1
symmnumber: 1
zpe: 926093.6 jmol-1
zpe.correction: 0.352730 hartree
zpe.thermalcorrener: 0.373590 hartree
zpe.thermalcorrenthalpy: 0.374534 hartree
zpe.thermalcorrgfe: 0.301569 hartree
zpe.sumelectzpe: -934.763926 hartree
zpe.sumelectthermal: -934.743066 hartree
zpe.sumelectthermalent: -934.742122 hartree
zpe.sumelectthermalfe: -934.815088 hartree
dipole: -19.9382 -2.5171 -2.1272
dipole: 20.2087
quadrupole: -60.6603 -99.5068 -113.0372
quadrupole: -2.8080 4.4903 0.6829
quadrupole: 30.4078 -8.4387 -21.9691 -2.8080 4.4903 0.6829
hfenergy: -935.1166561 hartree
pointgroup: C01 [X(C14H22N3O3)]
dipole: -7.760829 1.4904529 0.8729187 debye
polarizability: 277.2880002|-12.3263385|177.1151547|7.0677881|9.2316046|113.7321617 unknown
InChI: InChI=1S/C14H22N3O3/c1-4-17(3,5-2)11-10-15-14(18)12-6-8-13(9-7-12)16(19)20/h6-9,15H,4-5,10-11H2,1-3H3
charge 1 multiplicity 1
42 atoms
O  -0.821235 -0.723304 -0.947051
O  6.087562 -1.712874 -0.146109
O  6.356027 0.512605 0.292413
N  -4.299964 0.092972 0.207963
N  -0.704763 1.335371 0.081089
N  5.633975 -0.52044 0.026355
C  -2.95211 0.567769 0.792068
C  -5.217457 1.3311 0.008283
C  -4.965877 -0.870913 1.231665
C  -4.076309 -0.63701 -1.125183
C  -2.145018 1.52998 -0.126758
C  -6.606242 1.032942 -0.567778
C  -4.162918 -2.136573 1.553765
C  -0.098234 0.185875 -0.41547
C  1.390145 0.059757 -0.287785
C  1.950346 -1.229913 -0.482905
C  2.243556 1.161972 -0.009855
C  3.338886 -1.430292 -0.380868
C  3.635209 0.977843 0.092411
C  4.157706 -0.319707 -0.088163
H  -3.176343 1.032408 1.768237
H  -2.351426 -0.338119 0.948116
H  -5.296882 1.814022 0.998925
H  -4.665877 2.009225 -0.664548
H  -5.145139 -0.271536 2.142178
H  -5.941249 -1.140374 0.796473
H  -3.101741 -1.147681 -1.097837
H  -4.897331 -1.34996 -1.28681
H  -4.069464 0.096075 -1.945145
H  -2.36648 1.31992 -1.188548
H  -2.38984 2.585036 0.076774
H  -7.106331 1.999251 -0.756554
H  -6.562117 0.501451 -1.533118
H  -7.253336 0.470014 0.123826
H  -4.789904 -2.770869 2.205061
H  -3.925333 -2.732062 0.656761
H  -3.230877 -1.935045 2.10576
H  -0.163771 2.052897 0.563047
H  1.279693 -2.0608 -0.720725
H  1.85107 2.180232 0.092582
H  3.794425 -2.413656 -0.522677
H  4.316064 1.807712 0.298236
