program: Gaussian 09
title: 000201955
version: EM64L-G09RevD.01
frameworkgroup: C1[X(C19H28ClN7)]
method: RPBEPBE
basis: SDD
operation: Freq
keyword: #p
keyword: freq=noraman
keyword: PBEPBE/SDD
title: #p freq=noraman PBEPBE/SDD
converged: NO YES NO NO
title: Mulliken charges:
elementType: Cl N N N N N N N C C C C C C C C C C C C C C C C C C C H H H H H H H H H H H H H H H H H H H H H H H H H H H H
charge: -0.084110 -0.077272 -0.170343 -0.085944 -0.120071 -0.328012 -0.122356 -0.583874 -0.362550 -0.358457 -0.382077 -0.406701 -0.334642 0.487338 -0.484212 0.072925 -0.365079 -0.358619 -0.226615 -0.227424 -0.115852 0.040654 -0.389501 -0.334748 -0.005756 -0.338572 -0.693331 0.183238 0.212580 0.206153 0.185875 0.201010 0.219853 0.216353 0.210534 0.192253 0.228117 0.230500 0.251416 0.220035 0.233374 0.247381 0.247038 0.209713 0.247165 0.219105 0.183399 0.314101 0.190298 0.201059 0.209826 0.217068 0.213696 0.332764 0.331296
chargesum: 0.00000
title: Mulliken charges with hydrogens summed into heavy atoms:
elementType: Cl N N N N N N N C C C C C C C C C C C C C C C C C C C
charge: -0.084110 -0.077272 -0.170343 -0.085944 -0.120071 -0.013911 -0.122356 0.080186 0.033268 0.033571 0.038786 0.020185 0.085728 0.487338 -0.002296 0.072925 -0.145044 -0.125245 0.020766 0.019614 -0.115852 0.040654 0.067378 0.067756 -0.005756 0.052784 -0.052742
polarizability: 3.93972311e+02 9.04635378e+00 2.88960048e+02 -4.66470854e+00 1.01764093e+01 1.57534003e+02
1716.lowfreq: -23.9435 -14.5386 -0.0012 -0.0009 0.0008 0.9466 5.2667 6.9064 13.1005
frequency: -23.1827 -9.4132 13.0471 19.1748 33.7280 40.5183 43.0709 57.0550 64.9627 84.7106 92.1845 119.9343 129.5294 147.7307 156.7828 173.3878 181.1442 206.1016 215.2579 223.0094 226.3739 241.8384 256.2331 287.3851 292.8974 310.6019 324.5798 368.0217 397.4618 411.3831 414.1940 430.5933 439.0210 455.2517 482.1032 482.8223 504.7490 538.1760 546.6892 549.2917 574.5208 582.0553 598.3618 605.4579 626.6290 644.3897 689.3454 692.2754 719.2559 731.2092 735.0336 776.1303 782.8429 792.5564 800.3237 805.0905 808.8980 843.6649 895.9060 899.2553 910.1286 916.4087 924.2374 939.8210 946.2125 957.1612 981.0682 989.1250 1002.5926 1018.1811 1045.7831 1052.8873 1057.9939 1063.3189 1072.2580 1079.7305 1082.8344 1094.0711 1111.9403 1120.7715 1127.7700 1138.2312 1147.5595 1166.9324 1172.9761 1199.2573 1202.0948 1216.7447 1222.8291 1236.5625 1242.5505 1263.8507 1267.7361 1279.6639 1287.6082 1290.2007 1299.9560 1303.2336 1307.4958 1332.7268 1342.4046 1346.0056 1348.4414 1360.0409 1362.9392 1367.7851 1374.0734 1378.3687 1385.2282 1396.2763 1413.8114 1414.6324 1419.7069 1450.3896 1453.8814 1455.9030 1457.8050 1462.0447 1465.8727 1467.7049 1475.1464 1475.8023 1476.2031 1487.3483 1492.7665 1498.7641 1521.8745 1564.1029 1571.4509 1610.5171 1617.1283 2844.0427 2852.8898 2887.8280 2918.2974 2930.0983 2964.0287 2973.3249 2975.0851 2994.8622 2995.3798 3008.9457 3035.2281 3037.0627 3039.9077 3045.2791 3053.6033 3059.5916 3070.9840 3073.8808 3080.9984 3086.5261 3152.4162 3156.0773 3172.7891 3179.1357 3555.4283 3560.2412 3715.9750
redmass: 2.8470 3.1749 6.6436 4.9652 3.1218 3.9748 4.5931 2.1852 2.9558 4.5381 2.5062 6.4275 3.9679 5.1989 3.2117 4.5290 5.2268 2.6527 2.9022 2.4886 1.4005 3.1306 2.8605 3.5890 4.9412 3.7697 4.2965 3.0444 2.2291 2.9604 2.8287 7.4327 3.6653 3.2891 1.2831 2.5040 2.7279 4.4428 1.0932 3.8883 1.3170 4.9771 2.8752 3.6688 7.0043 2.8440 3.0766 3.0340 10.8303 4.6736 1.1015 1.6941 1.8496 1.2751 1.8833 1.8827 3.7622 1.5667 1.8213 8.0556 2.1874 2.9040 1.3918 1.3601 1.8436 2.1451 4.1369 4.1496 2.6945 4.2952 1.8148 2.0455 2.2199 2.2963 2.4718 2.7573 2.6627 2.2342 2.3590 1.4350 1.9652 2.4477 2.7524 2.3690 1.9184 1.1764 1.1484 1.8536 1.5852 3.2027 1.4428 1.3096 1.2856 1.5325 1.1258 1.2657 1.3302 1.2632 1.3422 1.8650 1.5816 1.5021 1.5011 1.9185 1.5011 1.7254 2.0172 1.7079 1.2179 1.5472 2.4947 3.6445 2.8165 1.1878 1.1949 1.0895 1.1325 1.1000 1.0960 1.0722 1.0431 1.1081 1.0699 1.0846 2.4900 3.1962 3.2310 2.9316 7.2426 6.1595 2.0643 1.0715 1.0701 1.0708 1.0685 1.0704 1.0589 1.0504 1.0468 1.0667 1.0607 1.0965 1.0892 1.0930 1.1000 1.0889 1.0904 1.0938 1.1005 1.0994 1.1013 1.0894 1.0871 1.0880 1.0956 1.0955 1.0446 1.0761 1.1058
irintensity: 0.0246 0.0278 0.0865 0.0979 1.2364 0.2701 1.1811 0.2441 0.1051 0.7084 0.1317 0.1072 1.4704 3.7268 3.6237 2.6738 3.2231 2.8740 0.6007 3.5402 0.2670 3.9853 1.2836 0.0685 7.0764 7.8737 16.5652 2.8067 3.5066 0.3911 2.5392 3.5703 0.6163 5.5291 243.7845 19.4732 23.4550 14.9624 2.0363 15.0970 84.9537 0.9447 45.5047 19.6781 0.1838 35.3454 12.2234 3.5341 0.9167 12.4856 11.0746 2.1097 2.6144 0.7288 1.2942 59.9445 46.7216 1.6148 6.2483 3.8836 9.0265 34.9580 1.3048 1.1155 6.3176 2.8588 27.6956 3.6486 62.0130 10.2282 3.2316 2.0934 0.9584 12.1900 1.2270 4.8920 10.8878 3.8466 19.0166 4.6017 6.0499 108.0161 14.4768 12.6944 16.5874 1.9235 1.7126 15.6800 8.5879 14.8827 214.6603 21.2650 1.0347 1.3833 3.9627 16.7053 26.0591 11.0315 25.3717 36.0056 7.5119 0.0741 36.3591 24.7671 18.2514 1.0066 1.5310 47.2327 9.3557 27.4529 221.5461 5.9324 10.0779 6.2791 71.0470 5.9525 5.1783 65.0781 40.4155 0.6441 14.8700 13.2596 9.0868 14.7530 386.6700 253.8983 446.8402 914.1620 2.4197 116.0542 234.3335 47.8797 86.2369 101.1816 54.1157 90.8214 20.0090 19.8583 56.2670 67.7774 5.2515 7.5903 34.1347 7.7439 32.6083 41.7472 21.8415 39.5375 54.6452 55.4849 41.8203 23.2239 9.6833 8.0594 18.1054 5.5641 101.0981 56.3598 47.9946
temp: 298.150 k
press: 1.00000 atm
elementType: 17 7 7 7 7 7 7 7 6 6 6 6 6 6 6 6 6 6 6 6 6 6 6 6 6 6 6 1 1 1 1 1 1 1 1 1 1 1 1 1 1 1 1 1 1 1 1 1 1 1 1 1 1 1 1
symmnumber: 1
zpe: 1202073.7 jmol-1
zpe.correction: 0.457846 hartree
zpe.thermalcorrener: 0.483510 hartree
zpe.thermalcorrenthalpy: 0.484455 hartree
zpe.thermalcorrgfe: 0.399007 hartree
zpe.sumelectzpe: -1582.116136 hartree
zpe.sumelectthermal: -1582.090471 hartree
zpe.sumelectthermalent: -1582.089527 hartree
zpe.sumelectthermalfe: -1582.174975 hartree
dipole: -6.8050 -1.5705 -0.4404
dipole: 6.9977
quadrupole: -191.6703 -145.7387 -173.3709
quadrupole: -8.6464 3.2952 3.2161
quadrupole: -21.4103 24.5213 -3.1109 -8.6464 3.2952 3.2161
hfenergy: -1582.5739819 hartree
pointgroup: C01 [X(C19H28Cl1N7)]
dipole: -2.6959246 0.4723672 0.2974224 debye
polarizability: 394.4631762|-6.3677081|276.2934934|2.6029353|39.4211012|169.7096931 unknown
InChI: InChI=1S/C19H28ClN7/c1-2-3-9-22-19-24-17(23-18(21)25-19)8-10-26-11-13-27(14-12-26)16-6-4-15(20)5-7-16/h4-7,22H,2-3,8-14,21H2,1H3
charge 0 multiplicity 1
55 atoms
Cl 9.665917 -1.092847 -0.023893
N  0.904125 0.96652 0.057888
N  3.741594 0.33093 0.175914
N  -3.94919 0.063598 -0.31192
N  -3.166851 2.007615 0.912192
N  -6.279548 -0.284461 -0.492516
N  -5.568895 1.580829 0.717496
N  -4.746843 3.431328 1.895885
C  1.90441 2.010471 0.377742
C  1.37453 -0.324638 0.608671
C  3.264562 1.66728 -0.251912
C  2.729369 -0.730893 0.002482
C  -0.460649 1.339466 0.514361
C  5.114362 0.005325 0.087048
C  -1.541405 0.466822 -0.147577
C  -2.96277 0.876605 0.176212
C  6.128886 1.002241 0.248197
C  5.553714 -1.339502 -0.13043
C  7.498247 0.674202 0.215435
C  6.924189 -1.673214 -0.156447
C  7.885925 -0.664322 0.018523
C  -5.234765 0.464828 -0.0195
C  -6.124695 -1.538298 -1.245279
C  -6.128727 -2.799214 -0.347889
C  -4.49792 2.306249 1.152615
C  -5.977512 -4.098643 -1.170619
C  -5.969865 -5.364748 -0.287066
H  2.034505 2.132255 1.484269
H  1.557425 2.976527 -0.033329
H  0.64341 -1.117907 0.372709
H  1.475804 -0.273207 1.724143
H  3.988783 2.440906 0.046402
H  3.164055 1.700268 -1.360142
H  2.588552 -0.97629 -1.075168
H  3.06811 -1.642938 0.523279
H  -0.560743 1.286373 1.626188
H  -0.640131 2.3935 0.238339
H  -1.43763 -0.597825 0.135446
H  -1.408818 0.495396 -1.246354
H  5.862307 2.047644 0.424071
H  4.8333 -2.142385 -0.3040
H  8.251681 1.456132 0.349793
H  7.231842 -2.709232 -0.326339
H  -6.942609 -1.600474 -1.989382
H  -5.167456 -1.48027 -1.790527
H  -5.296845 -2.715855 0.378161
H  -7.068711 -2.838398 0.239991
H  -7.207965 0.035404 -0.211668
H  -6.803487 -4.16744 -1.90845
H  -5.037895 -4.0504 -1.757537
H  -6.911004 -5.453788 0.287474
H  -5.85686 -6.281116 -0.894804
H  -5.135761 -5.334879 0.438599
H  -3.960512 3.981889 2.230383
H  -5.707943 3.692683 2.09924
