program: Gaussian 09
title: 000202206
version: EM64L-G09RevD.01
frameworkgroup: C1[X(C24H29N2O2P)]
method: RPBEPBE
basis: SDD
operation: Freq
keyword: #p
keyword: freq=noraman
keyword: PBEPBE/SDD
title: #p freq=noraman PBEPBE/SDD
converged: YES YES NO NO
title: Mulliken charges:
elementType: P O O N N C C C C C C C C C C C C C C C C C C C C C C C C H H H H H H H H H H H H H H H H H H H H H H H H H H H H H
charge: 1.371481 -0.553243 -0.602114 -0.744712 -0.784206 -0.028323 0.002334 -0.562566 -0.551794 -0.713550 -0.704766 0.500088 0.503522 -0.428268 -0.404110 -0.388378 -0.385625 0.354439 -0.228005 -0.226511 -0.232676 -0.223379 -0.243418 -0.255102 -0.388022 -0.274080 -0.199263 -0.218576 -0.252827 0.277372 0.272610 0.319048 0.327139 0.190355 0.244699 0.197653 0.203431 0.194079 0.245527 0.231466 0.202677 0.218885 0.236414 0.229042 0.225124 0.257924 0.233859 0.221979 0.221783 0.224527 0.227086 0.226107 0.225691 0.243663 0.285119 0.225751 0.226738 0.225903
chargesum: 0.00000
title: Mulliken charges with hydrogens summed into heavy atoms:
elementType: P O O N N C C C C C C C C C C C C C C C C C C C C C C C C
charge: 1.371481 -0.553243 -0.602114 -0.425664 -0.457067 0.249049 0.274944 -0.127513 -0.150710 -0.042479 -0.046790 0.500088 0.503522 -0.199226 -0.178986 -0.130454 -0.151766 0.354439 -0.006027 -0.004728 -0.008149 0.003707 -0.017310 -0.029410 -0.144359 0.011039 0.026487 0.008162 -0.026924
polarizability: 3.04205992e+02 -3.60051484e+00 3.04419518e+02 -9.43955546e+00 2.60385463e+01 2.57879248e+02
1716.lowfreq: -7.8979 -4.8394 0.0008 0.0009 0.0013 5.2063 9.0013 14.7500 17.4483
frequency: 3.0493 14.6712 17.0135 19.4525 23.3190 29.3213 35.8375 55.7385 59.2000 64.0279 82.1762 88.4452 93.7396 107.8349 141.6629 156.2518 198.3386 213.1699 220.6305 228.6622 242.9141 249.0317 269.2153 302.3017 315.7553 321.0338 336.0919 344.6885 354.0197 381.7593 396.4942 403.8617 404.2369 405.2730 410.4565 432.8665 449.6703 470.9465 498.8057 504.5067 521.6822 533.2100 562.8397 591.9842 596.3669 606.2028 617.4515 617.4883 632.2364 690.2274 704.1503 707.6668 747.0346 750.5374 763.1038 774.2074 792.7634 809.4286 823.1030 830.9788 831.8206 850.8036 854.9387 859.4188 876.3444 893.9922 898.0819 907.6020 920.4621 924.4298 964.1541 966.0643 973.1146 978.7077 982.9464 984.9449 987.7317 989.4091 990.1445 992.8955 995.3658 1020.3295 1027.0209 1027.2651 1035.3670 1049.8854 1059.3223 1075.8492 1089.8310 1095.3873 1099.7307 1102.9528 1137.7742 1148.1471 1164.6337 1170.7472 1171.3005 1172.9850 1188.6018 1189.4447 1190.6361 1197.5830 1200.7221 1218.4262 1219.1916 1268.6256 1283.6677 1306.5829 1310.5056 1313.4498 1319.9242 1324.1280 1331.4425 1346.0971 1379.8665 1381.2896 1383.3968 1383.4872 1384.6984 1397.5169 1412.6084 1438.0550 1440.2901 1440.4718 1460.5635 1461.9955 1470.5572 1471.2969 1473.9907 1476.1047 1477.1939 1483.7743 1484.1092 1592.0893 1592.2375 1592.5812 1599.4722 1613.8645 1614.4630 2973.2514 2974.3062 2978.3199 2980.0134 3021.2394 3033.9063 3041.7591 3048.0148 3072.6643 3073.6266 3095.8112 3098.4338 3110.3443 3113.0150 3116.0417 3125.1479 3126.7025 3130.1155 3135.8009 3137.3925 3141.8638 3147.4930 3154.5898 3160.4313 3164.2394 3166.9948 3179.3038 3526.1542 3534.9182
redmass: 4.6409 5.4732 4.8415 4.7472 4.4244 3.8881 4.4378 4.1322 3.7059 4.1452 4.5221 4.1915 4.0904 5.1646 5.3952 5.1497 3.2852 1.8659 1.9143 1.8523 1.5992 3.7171 4.7787 3.7797 3.8795 4.5630 2.1619 2.4892 1.8605 3.2918 2.4525 2.7781 2.8231 2.8413 2.8897 3.7080 2.9707 4.0906 3.7635 2.5102 3.4893 1.5827 4.2420 4.3025 4.5939 6.6591 6.2678 6.2919 7.6208 2.1040 1.8538 1.8602 1.8570 1.7784 1.6262 3.4798 3.5148 3.1362 4.8688 2.6271 1.4450 1.2557 1.8322 1.5484 2.4105 1.4305 1.5838 1.4369 1.4614 1.4695 1.6101 1.7447 1.4078 1.3785 2.3627 1.5475 3.8179 5.9289 3.0666 1.6432 1.3254 2.1146 2.2041 2.1911 3.0259 1.6780 2.5002 1.5348 2.6555 1.8527 1.6007 2.4544 2.4375 2.4354 1.1863 1.0558 1.0554 1.3002 1.1243 1.1307 2.0586 1.3859 1.4019 2.4018 2.2844 1.2348 1.3050 1.3137 1.3062 1.4014 1.3674 1.3115 1.2517 1.2762 8.5722 4.7822 2.2949 2.1015 1.2461 1.2816 1.2532 2.2567 2.1550 2.1661 1.0928 1.1064 2.1397 1.0667 1.0660 1.0875 1.0524 2.2454 2.2732 6.0138 6.0234 6.4605 6.2535 6.0747 6.1860 1.0397 1.0399 1.0589 1.0576 1.0857 1.0972 1.1012 1.0916 1.0955 1.0957 1.1000 1.1002 1.0872 1.0864 1.0876 1.0865 1.0848 1.0911 1.0909 1.0897 1.0959 1.0963 1.0942 1.1014 1.1012 1.0983 1.0973 1.0760 1.0751
irintensity: 0.0774 0.0683 0.3520 0.3323 0.2277 0.0437 0.1840 0.3632 0.1711 0.3635 0.0933 2.4210 0.2833 1.4282 0.2253 6.1312 4.1193 6.7623 3.1404 0.5088 2.3422 10.8243 4.7199 6.6329 29.2079 2.0325 8.2622 2.2730 7.0632 12.0664 8.3477 6.8808 1.3376 0.2500 0.3791 27.1648 15.4514 52.2889 81.2438 2.8840 33.3059 143.7745 21.5510 16.3807 3.7884 19.7798 0.0140 0.4306 57.8425 32.0967 64.1651 43.3791 30.4672 38.2078 72.0338 87.3515 80.9337 4.7658 109.5498 47.7950 13.0336 0.9217 18.3470 8.2905 33.5681 2.0179 0.5140 7.3952 0.0811 5.6875 11.4159 10.8633 0.1764 0.0350 102.6941 13.2042 4.5145 0.8061 0.4166 0.7221 2.3561 16.8223 6.5257 6.2576 27.1139 3.0697 48.1437 8.3892 21.8950 76.4714 2.4239 33.5647 247.3039 56.2687 26.8981 0.7273 0.1286 55.8596 0.2462 1.7285 93.9166 30.6374 4.9281 0.5940 0.2265 30.1435 2.0811 4.5071 2.5400 3.1512 6.6105 1.1133 0.6002 1.6188 0.8095 4.8626 10.0370 9.5588 30.1711 34.4066 38.6344 6.2501 9.2678 9.2791 4.2190 3.0859 78.6599 23.5711 8.5061 5.3034 5.4531 13.3183 19.2373 0.6134 1.1601 12.0193 36.0651 8.9391 5.9584 13.2742 29.5227 24.3856 67.3986 5.7308 13.5071 13.4206 1.6577 33.2101 41.5338 35.0943 25.4043 8.4429 7.9693 2.4374 3.1673 0.2813 11.3934 13.7951 17.1871 40.5796 40.7971 30.7316 28.5211 13.5212 13.5354 3.6823 17.0452 24.3926
temp: 298.150 k
press: 1.00000 atm
elementType: 15 8 8 7 7 6 6 6 6 6 6 6 6 6 6 6 6 6 6 6 6 6 6 6 6 6 6 6 6 1 1 1 1 1 1 1 1 1 1 1 1 1 1 1 1 1 1 1 1 1 1 1 1 1 1 1 1 1
symmnumber: 1
zpe: 1249905.8 jmol-1
zpe.correction: 0.476064 hartree
zpe.thermalcorrener: 0.505242 hartree
zpe.thermalcorrenthalpy: 0.506186 hartree
zpe.thermalcorrgfe: 0.409117 hartree
zpe.sumelectzpe: -1531.009374 hartree
zpe.sumelectthermal: -1530.980197 hartree
zpe.sumelectthermalent: -1530.979252 hartree
zpe.sumelectthermalfe: -1531.076322 hartree
dipole: 0.0298 -2.6808 -2.1313
dipole: 3.4249
quadrupole: -172.9101 -161.3465 -175.3510
quadrupole: -1.3866 -1.3509 7.0240
quadrupole: -3.0409 8.5227 -5.4818 -1.3866 -1.3509 7.0240
hfenergy: -1531.4854381 hartree
pointgroup: C01 [X(C24H29N2O2P1)]
dipole: -0.1611782 -0.0210375 -1.3376356 debye
polarizability: 302.3036936|6.442475|250.9277961|-7.3438151|17.1913914|313.273267 unknown
InChI: InChI=1S/C24H29N2O2P/c1-20(18-22-12-6-3-7-13-22)25-29(27,28-24-16-10-5-11-17-24)26-21(2)19-23-14-8-4-9-15-23/h3-17,20-21,25-26H,18-19H2,1-2H3
charge 0 multiplicity 1
58 atoms
P  0.340063 -0.706692 -1.108531
O  0.794086 1.010113 -1.174197
O  0.25681 -1.288183 0.377436
N  -1.153838 -0.98556 -1.926501
N  1.46768 -1.226761 -2.299811
C  -2.413442 -1.242355 -1.185925
C  2.815628 -0.684902 -2.589961
C  -3.064779 0.075692 -0.649114
C  3.964554 -1.481829 -1.885715
C  -3.370396 -2.043579 -2.088128
C  3.017303 -0.673559 -4.122237
C  -4.167184 -0.189628 0.364488
C  4.078045 -1.226034 -0.391001
C  -5.535658 0.003387 0.046754
C  4.831129 -0.119079 0.085237
C  -3.831903 -0.66229 1.661902
C  3.429018 -2.056777 0.556496
C  0.614776 1.900362 -0.083374
C  -6.547151 -0.268887 0.997139
C  4.937732 0.147699 1.467732
C  -4.838997 -0.936399 2.612903
C  3.531357 -1.793801 1.941469
C  -6.20171 -0.741477 2.283921
C  4.288524 -0.693381 2.402904
C  -0.051254 3.116487 -0.359038
C  1.139197 1.624748 1.201184
C  -0.183904 4.079802 0.665977
C  0.989258 2.595404 2.216862
C  0.332805 3.821718 1.957522
H  -2.131371 -1.856508 -0.310489
H  2.824017 0.354193 -2.217403
H  -1.232759 -0.645389 -2.889238
H  1.238504 -2.123474 -2.736891
H  -3.452785 0.66107 -1.506287
H  -2.26385 0.675896 -0.175836
H  4.912241 -1.19284 -2.381036
H  3.809559 -2.55976 -2.088977
H  -3.627117 -1.472117 -3.002272
H  -4.309851 -2.257474 -1.550069
H  -2.911811 -3.000195 -2.392415
H  3.023464 -1.703247 -4.53108
H  3.982839 -0.204338 -4.383807
H  2.207581 -0.107575 -4.613509
H  -5.809779 0.375164 -0.948753
H  5.342668 0.533891 -0.633962
H  -2.775512 -0.802949 1.924797
H  2.827617 -2.905661 0.212844
H  -7.59976 -0.109484 0.735812
H  5.525725 1.004751 1.815566
H  -4.56285 -1.295489 3.610981
H  3.010148 -2.44125 2.654891
H  -6.983315 -0.950501 3.02316
H  4.37228 -0.491732 3.4770
H  -0.440666 3.294284 -1.366532
H  1.64362 0.674234 1.396519
H  -0.692808 5.027073 0.455019
H  1.391571 2.389059 3.215034
H  0.225056 4.567828 2.752341
