program: Gaussian 09
title: 000201935
version: EM64L-G09RevD.01
frameworkgroup: C1[X(C22H28N2O3)]
method: RPBEPBE
basis: SDD
operation: Freq
keyword: #p
keyword: freq=noraman
keyword: PBEPBE/SDD
title: #p freq=noraman PBEPBE/SDD
converged: YES YES NO NO
title: Mulliken charges:
elementType: O O O N N C C C C C C C C C C C C C C C C C C C C C C H H H H H H H H H H H H H H H H H H H H H H H H H H H H
charge: -0.251241 -0.202951 -0.269731 -0.118495 -0.489932 -0.064143 -0.055578 -0.134880 -0.535691 -0.468474 0.157161 -0.374522 0.110181 -0.510963 -0.418910 0.183531 0.175203 0.191314 -0.720933 0.121865 -0.213429 -0.434208 -0.380823 -0.256652 -0.226301 -0.508318 -0.519854 0.198073 0.236357 0.231745 0.224523 0.177996 0.212579 0.195594 0.192088 0.212158 0.205616 0.224490 0.211556 0.229008 0.296892 0.213607 0.212920 0.215186 0.220894 0.231877 0.227438 0.217331 0.218257 0.237626 0.237339 0.230915 0.253977 0.225328 0.225401
chargesum: 0.00000
title: Mulliken charges with hydrogens summed into heavy atoms:
elementType: O O O N N C C C C C C C C C C C C C C C C C C C C C C
charge: -0.251241 -0.202951 -0.269731 -0.118495 -0.193040 0.133930 0.180779 0.096865 -0.133172 -0.060300 0.157161 0.029725 0.110181 -0.080857 0.021653 0.183531 0.175203 0.191314 -0.079219 0.121865 0.007465 -0.202330 -0.153385 -0.039321 -0.008044 0.197562 0.184853
polarizability: 3.47803243e+02 1.70195328e+01 2.69715127e+02 -1.97096898e+01 -7.67273598e+00 1.89538797e+02
1716.lowfreq: -0.0005 0.0003 0.0006 0.6679 3.8321 9.3222 19.5219 33.3873 35.4819
frequency: 19.4953 33.3664 35.4760 46.0076 52.0486 55.2308 61.3880 84.0205 100.0927 114.5277 116.5877 127.8533 144.7173 151.4844 154.3718 179.8054 194.1315 209.0088 227.0214 234.3056 257.8080 266.1029 275.0070 297.3312 302.2694 331.0307 342.4671 351.0045 373.2630 378.2098 398.7719 427.0671 440.5831 472.0719 484.3030 505.6295 520.8666 536.5618 560.6048 578.2777 586.8482 615.5561 638.3700 663.2271 688.2653 719.0483 741.1204 746.9132 751.9475 758.6239 761.0395 775.5645 799.3260 829.2590 848.7908 860.7419 871.8329 883.3967 899.0584 921.4299 925.8372 927.0260 941.5127 959.9722 967.5747 990.4973 1002.0920 1009.8926 1015.7127 1032.9572 1050.6137 1059.6169 1062.8893 1078.9755 1106.7395 1107.1208 1110.0554 1114.4522 1121.2686 1136.1564 1140.7466 1144.1442 1159.5843 1165.9555 1170.3778 1178.7563 1188.5067 1208.1914 1220.2443 1233.8196 1240.7909 1245.2492 1250.5316 1266.9928 1268.9658 1285.1470 1293.4233 1308.7076 1310.4673 1320.5367 1324.5742 1328.7690 1342.1116 1347.6733 1359.5150 1365.8205 1383.2743 1390.6471 1395.4161 1409.3009 1421.1010 1434.9637 1441.0886 1448.2664 1450.4907 1457.2306 1460.9073 1461.8561 1462.9672 1467.5378 1470.5414 1472.7754 1476.9583 1480.8468 1482.1375 1483.7388 1572.2531 1580.2590 1600.2012 1633.2108 1648.6798 2756.3345 2838.1661 2856.7325 2960.9472 2969.3293 2971.5779 2971.7167 2972.0225 2979.4901 2997.6927 2999.1442 3021.1350 3026.2527 3032.9135 3036.2346 3041.8032 3064.7890 3068.1998 3070.0238 3082.0902 3097.9365 3120.0703 3127.6180 3135.7471 3141.8397 3144.0736 3160.0547 3608.4685
redmass: 4.3493 4.4162 4.0036 3.8187 2.2659 3.6071 1.9673 3.0600 2.7906 1.8534 1.8424 2.8172 2.7018 2.5894 2.9987 3.7388 2.4127 3.2276 3.2688 1.5989 3.4347 3.6504 3.6068 3.9014 3.2690 3.7118 3.1772 3.7762 2.5356 5.7258 3.1996 3.0158 3.5187 3.7803 1.2319 2.7752 4.0108 3.8389 4.9427 3.5499 4.1904 3.8243 4.2972 4.7399 4.5761 3.6722 2.6418 1.4479 4.9914 5.0458 3.3398 1.6824 5.5379 2.1349 1.4637 2.7222 2.5232 1.6580 2.0212 5.8427 4.4658 1.3939 2.7384 2.8613 1.2978 1.9796 2.1439 2.0977 2.1741 2.0714 2.9277 2.3192 2.4645 2.1525 1.5646 1.5627 1.2653 2.1940 2.0403 2.1446 2.0001 1.4737 1.5248 2.1579 1.9562 2.4833 1.3718 1.4401 1.3678 1.9241 1.3821 1.4972 1.4136 1.4290 2.0572 1.5607 1.7640 1.2509 1.3963 1.4347 1.3413 1.5594 1.6577 1.5087 1.6704 1.8147 1.3809 1.2986 1.3178 3.6956 1.2212 1.2297 2.6546 1.2029 1.0510 1.1066 1.0532 1.1015 1.0536 1.0507 1.0822 1.5613 1.8798 2.9717 1.1411 1.0587 8.2972 6.6503 7.5344 7.0529 6.2688 1.0772 1.0709 1.0709 1.0819 1.0324 1.0599 1.0581 1.0377 1.0598 1.0843 1.0297 1.0991 1.0893 1.1000 1.0893 1.1001 1.1049 1.0988 1.1007 1.0896 1.1041 1.0847 1.0889 1.1004 1.0950 1.1043 1.1001 1.0801
irintensity: 0.5511 0.2142 0.7288 1.9806 1.3984 0.1828 2.3566 0.8175 2.8491 1.3891 0.9774 1.7726 1.8086 0.4261 8.0575 1.1605 2.5019 0.9619 1.9644 0.4131 1.0116 0.4093 5.3655 4.1744 5.0897 13.9237 1.6348 0.5309 1.4412 9.5248 0.5557 11.6832 0.8091 0.2101 74.8904 5.0153 6.7674 3.2159 3.3991 2.2826 0.3533 1.4151 0.6490 9.1012 5.6532 13.8106 10.8749 78.2665 16.6938 11.8307 11.1437 11.4530 8.6433 0.7568 0.0849 0.5485 5.3457 4.3062 9.4931 9.6473 7.3674 2.0408 10.3101 9.6684 0.0302 2.1433 18.6619 15.0800 26.1243 0.3969 13.3750 43.4424 38.2224 61.5904 12.1982 17.5077 0.2285 31.1692 4.4254 12.4275 53.9151 40.6344 46.6949 18.3911 136.3595 113.8456 12.0880 22.8771 12.4034 9.6708 28.1852 39.9973 8.4723 76.1551 160.8550 11.3475 15.9770 3.0224 5.9636 8.1211 8.5970 21.7498 78.2105 6.9601 10.0190 14.4191 17.1594 8.2715 6.1425 13.3632 32.6772 8.4637 6.7566 8.4112 12.2925 8.4916 27.4491 3.2205 17.1229 14.9839 3.1157 29.9066 10.0491 3.1946 20.9250 8.0223 135.5225 0.9410 8.4599 2.0516 248.3182 65.8515 49.5871 159.7001 11.7830 73.8294 53.4331 37.6290 29.5268 20.4172 17.4193 47.5353 33.2029 15.8371 8.5583 77.0959 30.7650 40.0196 45.8045 66.4158 20.4042 29.4754 1.6864 4.1832 18.4052 37.4644 18.2336 39.0717 37.2500
temp: 298.150 k
press: 1.00000 atm
elementType: 8 8 8 7 7 6 6 6 6 6 6 6 6 6 6 6 6 6 6 6 6 6 6 6 6 6 6 1 1 1 1 1 1 1 1 1 1 1 1 1 1 1 1 1 1 1 1 1 1 1 1 1 1 1 1
symmnumber: 1
zpe: 1204819.8 jmol-1
zpe.correction: 0.458892 hartree
zpe.thermalcorrener: 0.485298 hartree
zpe.thermalcorrenthalpy: 0.486242 hartree
zpe.thermalcorrgfe: 0.400963 hartree
zpe.sumelectzpe: -1188.271008 hartree
zpe.sumelectthermal: -1188.244602 hartree
zpe.sumelectthermalent: -1188.243658 hartree
zpe.sumelectthermalfe: -1188.328937 hartree
dipole: 1.6420 -2.7610 1.5704
dipole: 3.5757
quadrupole: -165.3739 -142.2912 -160.8711
quadrupole: -10.0349 5.5264 -1.4010
quadrupole: -9.1951 13.8875 -4.6924 -10.0349 5.5264 -1.4010
hfenergy: -1188.7299 hartree
pointgroup: C01 [X(C22H28N2O3)]
dipole: -0.6511572 1.0751016 0.6318416 debye
polarizability: 347.6306065|17.0983637|269.6475917|19.9833381|8.8323495|189.7789691 unknown
InChI: InChI=1S/C22H28N2O3/c1-4-14-12-24-10-9-16-15-7-5-6-8-19(15)23-21(16)20(24)11-17(14)18(13-26-2)22(25)27-3/h5-8,13-14,17,20,23H,4,9-12H2,1-3H3
charge 0 multiplicity 1
55 atoms
O  -5.374207 0.971623 -0.656183
O  -3.954149 2.350115 1.158294
O  -4.298742 -0.685806 -1.884462
N  0.559166 -1.996438 -0.137366
N  2.471504 1.196554 -0.784503
C  0.675421 -0.656247 -0.777111
C  -1.928146 -1.794742 0.072639
C  -1.829842 -0.354116 -0.547077
C  -0.447621 0.267077 -0.234379
C  -0.739451 -2.627268 -0.473782
C  2.063233 -0.12481 -0.528887
C  1.731735 -2.873489 -0.390287
C  3.1397 -0.855875 -0.036666
C  2.999429 -2.318174 0.302412
C  -1.980235 -1.814522 1.621922
C  -3.036311 0.524876 -0.205806
C  4.275464 0.042609 0.030119
C  3.827166 1.328171 -0.450247
C  -2.510068 -3.150188 2.191656
C  -4.254138 0.203474 -0.986023
C  -2.937291 1.502856 0.753065
C  5.627881 -0.102422 0.43698
C  4.684779 2.445586 -0.529811
C  6.48911 1.010623 0.359949
C  6.023315 2.271047 -0.117954
C  -6.594113 0.664997 -1.437488
C  -3.568723 3.334096 2.188865
H  0.51319 -0.748834 -1.889965
H  -2.859579 -2.250066 -0.319412
H  -1.874555 -0.508002 -1.6467
H  -0.278363 0.393409 0.851133
H  -0.377654 1.266264 -0.71142
H  -0.752924 -3.640433 -0.032284
H  -0.860621 -2.747544 -1.582313
H  1.931821 -2.984696 -1.486919
H  1.492321 -3.877267 0.005985
H  3.884348 -2.893837 -0.034226
H  2.912359 -2.463453 1.397548
H  -2.637979 -0.996282 1.974757
H  -0.965817 -1.619712 2.01946
H  1.878739 1.936968 -1.152346
H  -3.531034 -3.361717 1.821068
H  -1.865696 -4.002356 1.905489
H  -2.549568 -3.124194 3.296431
H  -1.976826 1.650485 1.269951
H  5.997748 -1.065666 0.80673
H  4.333065 3.416172 -0.898315
H  7.535313 0.911282 0.670659
H  6.717515 3.117571 -0.167296
H  -6.894233 -0.386655 -1.290553
H  -6.418518 0.838346 -2.51304
H  -7.354468 1.353923 -1.043109
H  -4.492455 3.880668 2.42598
H  -2.807022 4.035138 1.798593
H  -3.18827 2.828487 3.096544
