program: Gaussian 09
title: 000201933
version: EM64L-G09RevD.01
frameworkgroup: C1[X(C22H27N3OS)]
method: RPBEPBE
basis: SDD
operation: Freq
keyword: #p
keyword: freq=noraman
keyword: PBEPBE/SDD
title: #p freq=noraman PBEPBE/SDD
converged: NO YES NO NO
title: Mulliken charges:
elementType: S O N N N C C C C C C C C C C C C C C C C C C C C C C H H H H H H H H H H H H H H H H H H H H H H H H H H H
charge: 0.187202 -0.247968 -0.270790 -0.093426 -0.370319 0.274080 -0.479205 -0.468035 -0.399182 -0.395309 0.086002 -0.339795 -0.320414 0.401931 -0.362792 -0.373273 -0.342205 -0.706851 -0.237195 -0.256768 -0.276573 -0.151169 -0.185724 -0.268981 -0.233775 -0.213284 -0.270349 0.212434 0.240855 0.240173 0.208673 0.211479 0.244661 0.233973 0.208408 0.233891 0.233057 0.324449 0.202314 0.195197 0.216994 0.241157 0.229221 0.236160 0.256800 0.269561 0.220970 0.233697 0.229591 0.258825 0.240681 0.233832 0.226359 0.230757
chargesum: 0.00000
title: Mulliken charges with hydrogens summed into heavy atoms:
elementType: S O N N N C C C C C C C C C C C C C C C C C C C C C C
charge: 0.187202 -0.247968 -0.270790 -0.093426 -0.045870 0.274080 -0.025917 -0.019189 0.056959 0.047072 0.086002 0.127153 0.077097 0.401931 0.095359 -0.144052 -0.106045 -0.180490 -0.016226 -0.023071 -0.046983 -0.151169 0.073101 -0.028299 0.000057 0.013075 -0.039592
polarizability: 3.09503865e+02 -6.26665794e+00 3.25745879e+02 -1.66976818e+01 1.51986937e+01 1.81869834e+02
1716.lowfreq: -3.8793 -1.2977 -0.0010 0.0000 0.0012 6.2950 17.9746 23.7142 30.3010
frequency: 17.9547 23.6683 30.2610 39.3509 47.4921 59.0262 68.7178 80.3887 100.4147 135.9278 158.7963 178.6390 187.1108 206.1571 207.0698 223.7211 229.6989 243.7510 269.6150 281.2809 289.6826 313.0896 326.0913 343.4545 370.4886 379.5104 397.5066 406.9322 409.7556 420.3922 470.9583 474.5941 492.8232 515.5344 521.5386 556.9658 561.6564 610.9650 613.2784 637.2220 663.2132 670.2894 692.0377 696.4142 696.7322 715.8094 718.4552 720.7894 744.8992 751.3693 775.7808 801.1201 816.2245 840.2957 846.0810 876.0420 878.3504 906.8998 919.9119 938.4742 943.9535 958.2240 971.4123 972.6770 980.0795 981.2704 982.7077 991.2035 1009.0286 1021.0564 1028.6897 1035.2514 1045.8430 1057.6140 1070.9014 1074.7395 1078.1104 1082.8387 1087.4943 1093.3260 1101.9734 1120.1730 1136.7408 1147.9301 1171.7475 1173.7696 1174.2360 1183.3628 1185.7977 1191.0164 1201.1225 1207.6699 1225.5510 1243.9901 1260.1498 1278.2029 1283.0830 1295.3408 1299.0906 1319.4169 1322.1513 1326.5609 1336.5034 1340.4135 1345.3583 1352.8384 1365.4096 1368.1741 1374.6827 1381.2977 1392.6083 1416.3081 1428.4690 1450.0209 1452.8649 1459.8160 1463.8382 1466.3973 1470.1955 1472.6702 1476.0128 1485.0866 1497.6599 1523.8891 1576.5961 1582.6682 1593.0604 1620.7880 1660.5165 2884.7460 2907.1290 2908.3376 2917.3087 2938.7909 3001.6267 3007.4401 3009.5524 3010.9948 3022.2638 3026.3352 3036.2732 3056.4502 3080.5286 3082.1528 3093.5223 3118.2141 3124.1671 3124.8321 3131.9838 3134.5079 3144.4541 3152.7318 3163.1147 3165.1222 3178.8146 3586.0659
redmass: 5.6866 5.9580 5.3729 5.2378 3.9852 3.9186 5.5763 5.0802 4.0841 4.9106 3.1729 4.1207 4.0423 2.8322 3.0905 4.7299 3.7892 3.4739 2.9198 2.6947 2.7373 2.8534 4.2169 3.8765 3.7388 2.1567 7.1392 2.9288 4.7603 3.0030 3.1688 3.0817 3.5797 2.8712 2.4436 1.1721 4.2489 6.4149 6.3717 4.9154 4.2195 5.7149 3.8724 2.2154 2.0657 6.6633 2.3414 4.3737 1.4728 1.8040 1.6231 1.5174 1.2865 3.5699 1.2646 1.3920 2.1203 1.3634 2.7961 2.3402 2.1989 1.3494 2.0354 1.9989 2.9923 1.5025 4.4687 1.3035 2.9219 3.4443 1.6140 2.0958 2.1830 2.2074 2.2765 2.5286 2.2704 1.4461 1.7306 1.7505 2.7141 4.1302 1.7875 2.6898 1.3840 1.0656 1.0851 1.8416 1.7760 1.0986 1.1347 1.1475 1.3370 1.8985 1.3003 1.1771 1.3671 1.5161 1.7525 1.3384 1.3302 1.6130 1.3354 1.5251 1.3767 1.5557 1.3883 2.1742 6.4076 4.2003 1.4260 1.9180 2.1118 2.4870 1.2006 1.0900 1.1034 1.1101 1.1365 1.5229 1.1143 1.1018 2.3710 1.1170 5.9097 5.8221 5.7880 6.0598 7.5657 1.0694 1.0695 1.0549 1.0673 1.1082 1.0683 1.0668 1.0664 1.0809 1.0607 1.0887 1.0904 1.1002 1.0975 1.0973 1.1058 1.0863 1.0850 1.0868 1.0892 1.0924 1.0956 1.0922 1.1013 1.0972 1.0954 1.0792
irintensity: 0.1531 0.1713 0.0491 0.4637 0.6186 1.6374 5.2251 0.0911 1.2747 2.6985 0.9164 0.5831 0.2417 2.1514 2.0166 1.8757 0.2888 1.1962 2.0154 1.5984 4.0366 1.2475 4.8943 0.2782 1.4926 4.4806 3.7236 0.5052 11.4587 0.4591 11.8568 1.2588 5.9603 12.5949 1.5804 110.9572 5.0202 0.5356 0.3132 6.4329 10.9732 10.5297 5.5446 44.5261 19.4736 0.3048 2.5345 12.0908 101.7580 58.0143 9.9841 1.4151 1.2058 2.4351 0.4636 7.7534 5.8708 2.3026 14.1972 1.9478 19.8922 0.2397 1.9372 2.6994 7.1557 0.4558 1.1098 1.2796 11.9410 22.7272 2.6617 19.8126 3.7155 2.0297 9.0896 11.3096 26.5881 3.1544 7.0400 0.0355 38.2904 4.9507 8.7952 7.6231 11.1624 3.6367 1.5227 32.8994 30.6882 1.9811 0.6999 10.9204 9.8445 64.1050 13.2241 0.8931 5.3189 19.0608 56.5712 1.1207 0.1076 0.3178 15.7128 13.6471 3.9221 27.4054 20.8830 150.7659 2.0707 11.8582 8.2776 41.4515 9.7575 0.9608 19.4578 9.1999 6.6929 6.1049 3.1406 20.8693 17.1022 41.5973 154.0321 6.6012 13.1081 3.5011 43.1163 155.0845 331.2123 77.7036 45.9045 96.6991 85.2138 45.0051 14.4877 30.3422 19.5816 8.3604 10.6612 69.4520 27.2533 27.6001 1.1992 42.4376 24.1428 3.3756 7.6379 2.9322 11.0583 2.7035 31.5110 32.9398 25.3916 31.7586 5.0658 47.8781
temp: 298.150 k
press: 1.00000 atm
elementType: 16 8 7 7 7 6 6 6 6 6 6 6 6 6 6 6 6 6 6 6 6 6 6 6 6 6 6 1 1 1 1 1 1 1 1 1 1 1 1 1 1 1 1 1 1 1 1 1 1 1 1 1 1 1
symmnumber: 1
zpe: 1179803.7 jmol-1
zpe.correction: 0.449363 hartree
zpe.thermalcorrener: 0.474067 hartree
zpe.thermalcorrenthalpy: 0.475011 hartree
zpe.thermalcorrgfe: 0.393130 hartree
zpe.sumelectzpe: -1490.079474 hartree
zpe.sumelectthermal: -1490.054771 hartree
zpe.sumelectthermalent: -1490.053826 hartree
zpe.sumelectthermalfe: -1490.135707 hartree
dipole: -4.0822 0.2783 0.4124
dipole: 4.1124
quadrupole: -153.1298 -170.3429 -169.8112
quadrupole: -6.2347 -3.0332 8.5462
quadrupole: 11.2982 -5.9149 -5.3832 -6.2347 -3.0332 8.5462
hfenergy: -1490.5288374 hartree
pointgroup: C01 [X(C22H27N3O1S1)]
dipole: 1.5401907 0.2024255 0.4523061 debye
polarizability: 297.8838887|9.6186533|301.203152|41.9167163|-51.8769113|218.0325366 unknown
InChI: InChI=1S/C22H27N3OS/c26-21-22(25(18-23-21)19-8-3-1-4-9-19)12-15-24(16-13-22)14-7-17-27-20-10-5-2-6-11-20/h1-6,8-11,23H,7,12-18H2
charge 0 multiplicity 1
54 atoms
S  -4.732888 -0.305876 -1.875609
O  2.343929 3.872531 0.184207
N  2.865669 0.328384 0.573896
N  -0.649954 2.008971 -1.257051
N  3.896181 2.323184 1.030062
C  1.938362 1.387195 0.071052
C  0.573557 1.392764 0.833813
C  1.733556 1.313222 -1.477034
C  -0.47146 2.323935 0.189339
C  0.6271 2.260075 -1.983483
C  2.71378 2.688491 0.416048
C  4.087648 0.883798 1.186271
C  -1.792229 2.767523 -1.841886
C  2.676798 -1.064064 0.552641
C  -3.147878 2.078021 -1.561188
C  3.677352 -1.920179 1.114561
C  1.518398 -1.688919 -0.00934
C  -3.310599 0.810205 -2.419423
C  3.521521 -3.321193 1.114424
C  1.377566 -3.090703 0.001803
C  2.371443 -3.926089 0.56125
C  -4.039503 -1.173608 -0.410018
C  -2.696037 -1.060658 0.025314
C  -4.936724 -2.024328 0.287266
C  -2.258571 -1.808487 1.144659
C  -4.489528 -2.762556 1.403419
C  -3.146423 -2.660565 1.838462
H  0.746236 1.700043 1.882659
H  0.172328 0.366713 0.860083
H  1.472806 0.279081 -1.756477
H  2.689065 1.555528 -1.979556
H  -1.436513 2.181106 0.708647
H  -0.165838 3.388251 0.324646
H  0.956145 3.319319 -1.871542
H  0.46073 2.065674 -3.059615
H  5.005357 0.535747 0.662268
H  4.176718 0.599038 2.258549
H  4.573714 3.014858 1.349437
H  -1.81677 3.818353 -1.463292
H  -1.63856 2.830627 -2.937179
H  -3.976699 2.779699 -1.773877
H  -3.220633 1.822247 -0.48827
H  4.586462 -1.500571 1.555939
H  0.722808 -1.09597 -0.465054
H  -3.566694 1.064467 -3.463148
H  -2.382214 0.2147 -2.430236
H  4.31104 -3.942124 1.553797
H  0.472648 -3.529444 -0.434411
H  2.252345 -5.01403 0.564489
H  -1.986299 -0.402809 -0.489993
H  -5.977847 -2.109871 -0.04487
H  -1.21464 -1.726428 1.469769
H  -5.192158 -3.417527 1.931052
H  -2.7985 -3.236051 2.702931
