program: Gaussian 09
title: 000201898
version: EM64L-G09RevD.01
frameworkgroup: C1[X(C11H17NS)]
method: RPBEPBE
basis: SDD
operation: Freq
keyword: #p
keyword: freq=noraman
keyword: PBEPBE/SDD
title: #p freq=noraman PBEPBE/SDD
converged: NO YES NO NO
title: Mulliken charges:
elementType: S N C C C C C C C C C C C H H H H H H H H H H H H H H H H H
charge: -0.034522 -0.286279 -0.394953 -0.551486 -0.361913 0.504039 -0.284744 -0.420960 -0.404320 -0.707446 -0.226466 -0.230003 -0.243685 0.233279 0.198915 0.202040 0.202646 0.180187 0.209377 0.243385 0.207431 0.207686 0.230434 0.231221 0.253291 0.276446 0.222990 0.223223 0.227028 0.093157
chargesum: 0.00000
title: Mulliken charges with hydrogens summed into heavy atoms:
elementType: S N C C C C C C C C C C C
charge: 0.058635 -0.042895 0.037241 -0.146800 0.027651 0.504039 0.130373 -0.190525 -0.173098 -0.177708 -0.003476 -0.006780 -0.016657
polarizability: 1.94990296e+02 5.27751993e+00 1.22883005e+02 -2.16613480e+01 8.98673442e+00 1.02620548e+02
1716.lowfreq: -4.0906 -0.0024 -0.0016 -0.0006 2.4264 11.3933 17.4468 28.2299 40.2635
frequency: 17.1285 28.1661 40.2489 52.1053 88.9324 94.6827 122.8143 154.9825 189.8882 210.0589 228.8764 294.0312 333.2412 394.6111 403.2030 435.6346 518.6602 579.9570 618.1372 669.8872 685.1360 705.0323 744.2529 759.4523 759.7998 810.5585 842.7202 852.0058 863.6463 915.6158 974.9015 989.3905 991.0235 993.9401 1026.7936 1028.3461 1037.4416 1043.0818 1066.1617 1090.0002 1107.6660 1138.7852 1142.1365 1171.4968 1186.3635 1207.3600 1216.1124 1242.4658 1258.8095 1268.8385 1278.1983 1281.3712 1321.6291 1327.6223 1342.8249 1382.7469 1385.8081 1440.2525 1447.4143 1453.9073 1467.8399 1478.9782 1484.4372 1485.6653 1495.9791 1593.4090 1614.8804 2437.1637 2848.2440 2891.0118 2970.1084 2977.7146 2992.3997 3006.3266 3023.3543 3032.7764 3055.2790 3112.1042 3113.3414 3114.2781 3130.8170 3142.3820 3161.5191 3425.7171
redmass: 3.6677 3.3826 4.7297 2.3925 3.1586 2.9269 2.1462 2.5533 5.2270 3.1300 1.2410 4.2245 2.3596 4.3271 2.8125 3.7745 3.3243 4.1846 6.3559 1.3280 3.1952 1.7255 1.2138 1.1438 1.8104 3.7503 1.1614 1.2406 1.2619 1.4606 1.3889 4.5885 2.1848 1.7876 2.2187 2.3545 1.8823 2.7272 2.0991 2.1008 1.5237 1.3612 2.4498 1.0517 1.1141 1.4361 2.3420 1.2401 1.2844 1.2288 1.1789 1.0966 1.3318 1.2614 1.4299 7.5191 1.4519 2.1834 1.1227 1.1580 1.0896 1.1141 2.1580 1.1090 1.0888 6.0498 6.1914 1.0383 1.0710 1.0696 1.0627 1.0642 1.0816 1.0895 1.0994 1.0595 1.1026 1.1061 1.0871 1.0868 1.0907 1.0958 1.1015 1.0740
irintensity: 0.0962 0.0738 0.1498 0.8057 2.5236 0.1570 5.6670 3.9241 0.3026 2.1545 24.2408 5.3021 0.3733 5.1495 0.0034 5.0546 14.1406 2.0480 0.0858 95.0051 20.3084 55.6591 6.1898 11.2474 37.8701 3.3408 6.9827 0.5477 1.1360 2.4517 0.0148 0.5129 0.4316 1.6447 5.7358 4.2138 5.6134 4.6124 7.9962 9.6959 1.2343 75.2691 30.6208 0.1143 0.2080 3.7808 0.1784 4.9737 0.1682 7.5864 0.4307 0.5455 7.5245 1.1083 5.3160 0.1547 3.6192 6.5219 15.5993 27.3471 2.2182 8.0264 20.7982 0.0589 9.4095 1.4148 12.1815 30.6115 98.8525 89.1978 0.9193 40.5814 50.5703 23.0611 2.6253 25.3629 54.0429 16.4751 9.8266 9.0139 10.6927 47.5727 24.4763 1.1702
temp: 298.150 k
press: 1.00000 atm
elementType: 16 7 6 6 6 6 6 6 6 6 6 6 6 1 1 1 1 1 1 1 1 1 1 1 1 1 1 1 1 1
symmnumber: 1
zpe: 665794.1 jmol-1
zpe.correction: 0.253588 hartree
zpe.thermalcorrener: 0.268184 hartree
zpe.thermalcorrenthalpy: 0.269128 hartree
zpe.thermalcorrgfe: 0.208474 hartree
zpe.sumelectzpe: -881.157527 hartree
zpe.sumelectthermal: -881.142930 hartree
zpe.sumelectthermalent: -881.141986 hartree
zpe.sumelectthermalfe: -881.202641 hartree
dipole: 1.5174 -0.2784 0.6227
dipole: 1.6636
quadrupole: -104.0824 -82.9978 -86.6042
quadrupole: -1.7271 -7.6642 4.2928
quadrupole: -12.8543 8.2304 4.6239 -1.7271 -7.6642 4.2928
hfenergy: -881.4111145 hartree
pointgroup: C01 [X(C11H17N1S1)]
dipole: -0.5937496 -0.0279346 -0.2740215 debye
polarizability: 195.3858013|3.260884|126.3588432|-21.1207056|-0.7319099|98.7492046 unknown
InChI: InChI=1S/C11H17NS/c13-10-9-12-8-4-7-11-5-2-1-3-6-11/h1-3,5-6,12-13H,4,7-10H2
charge 0 multiplicity 1
30 atoms
S  7.00144 0.123984 0.328497
N  2.81848 -0.096274 0.270781
C  0.358624 -0.065549 -0.100477
C  -0.788809 -0.032974 -1.147264
C  1.752939 -0.074588 -0.755802
C  -2.165151 -0.011588 -0.49804
C  4.201093 -0.075919 -0.253062
C  -2.888507 -1.212272 -0.278831
C  -2.739387 1.210169 -0.05961
C  5.191398 0.162742 0.898538
C  -4.148194 -1.195526 0.362625
C  -3.998211 1.233341 0.581373
C  -4.707723 0.028547 0.796053
H  0.283233 0.810689 0.570449
H  0.238019 -0.965121 0.538125
H  -0.657345 0.863231 -1.785867
H  -0.695864 -0.915871 -1.810017
H  1.819059 -0.935582 -1.470161
H  1.881213 0.846564 -1.359693
H  2.677892 -0.868689 0.937913
H  4.275342 0.758475 -0.978479
H  4.492179 -1.004097 -0.802386
H  -2.463386 -2.165514 -0.618171
H  -2.19677 2.149334 -0.227386
H  5.13557 -0.644707 1.649803
H  4.986786 1.121066 1.400409
H  -4.69377 -2.133149 0.519811
H  -4.427278 2.187315 0.908878
H  -5.685524 0.044255 1.290494
H  6.934052 1.264707 -0.456504
