program: Gaussian 09
title: 000201892
version: EM64L-G09RevD.01
frameworkgroup: C1[X(C11H18N2O3)]
method: RPBEPBE
basis: SDD
operation: Freq
keyword: #p
keyword: freq=noraman
keyword: PBEPBE/SDD
title: #p freq=noraman PBEPBE/SDD
converged: YES YES NO NO
title: Mulliken charges:
elementType: O O O N N C C C C C C C C C C C H H H H H H H H H H H H H H H H H H
charge: -0.240763 -0.221852 -0.219534 -0.055512 -0.184801 -0.376806 -0.377302 -0.382683 -0.381557 -0.399923 -0.393920 0.166491 0.189581 0.249575 -0.671836 -0.671691 0.181659 0.244291 0.242489 0.184364 0.195075 0.205388 0.202222 0.194586 0.217061 0.189484 0.248701 0.247326 0.236239 0.236092 0.237964 0.239144 0.237021 0.233425
chargesum: 0.00000
title: Mulliken charges with hydrogens summed into heavy atoms:
elementType: O O O N N C C C C C C C C C C C
charge: -0.240763 -0.221852 -0.219534 -0.055512 -0.184801 0.049144 0.049552 0.017781 0.015251 0.006622 0.102107 0.166491 0.189581 0.249575 0.038459 0.037899
polarizability: 1.59209000e+02 -9.41875143e+00 1.40033057e+02 3.00463530e+00 1.36701962e+00 1.12807025e+02
1716.lowfreq: -26.6857 -11.1183 -7.3207 0.0006 0.0008 0.0010 9.6920 30.1221 36.2042
frequency: -17.6155 29.5355 35.3983 61.7393 112.3587 136.3923 174.6155 179.4375 197.9290 216.6009 224.7938 235.2467 281.3234 297.9596 307.5849 361.2256 382.4343 397.0222 415.2923 448.0152 461.6116 550.2628 581.7419 604.4065 614.2786 665.1195 685.5906 722.7188 767.8941 802.9876 836.8284 840.8889 848.5136 855.1648 898.0422 939.5875 948.9560 956.7759 992.8169 996.3353 1003.1984 1008.0560 1043.3825 1077.0927 1099.9921 1116.6476 1146.4187 1152.5677 1175.0050 1180.2296 1200.1679 1238.9833 1259.3649 1262.9517 1274.8274 1298.2024 1323.3970 1332.0367 1337.9222 1341.7971 1348.0162 1378.3409 1379.6104 1387.1306 1394.9152 1407.9031 1449.7509 1452.3623 1454.1937 1457.2974 1459.8541 1468.0771 1471.6266 1474.0171 1482.4184 1484.3833 1647.7772 1725.0865 2848.5283 2854.7468 2965.2424 2984.7860 2987.3766 2998.8526 3001.0293 3003.0525 3035.3813 3041.6160 3046.7886 3047.5841 3056.2087 3069.1050 3102.5044 3105.9184 3106.5478 3111.0206
redmass: 3.5977 4.1413 3.7359 4.2959 4.8975 6.0318 1.0448 3.8599 3.1585 1.1802 2.6395 1.8618 2.7822 3.9257 3.8137 1.7044 1.9845 4.6985 4.3463 2.6624 3.2468 1.8637 4.4898 10.1825 3.7541 8.0050 9.2538 5.6082 5.0311 1.4859 4.4626 2.9750 2.4454 1.6511 2.5461 1.4478 2.3991 1.3363 2.6796 2.4498 1.3390 4.1397 2.1228 1.7005 2.1132 2.6132 1.8116 1.2018 2.2182 2.3120 4.3691 3.1281 1.2697 2.2084 1.3339 3.2024 1.5875 1.3091 1.3838 1.4684 1.4148 1.2087 1.5245 1.3622 1.2144 1.3112 1.0944 1.0480 1.1016 1.0891 1.0469 1.0982 1.0655 1.0779 1.0558 1.0936 11.6880 11.7774 1.0709 1.0701 1.0638 1.0608 1.0612 1.0346 1.0352 1.0584 1.0955 1.0894 1.0914 1.1021 1.1035 1.1061 1.1005 1.1017 1.1006 1.1006
irintensity: 0.3309 0.4941 0.6378 2.4562 0.0192 4.8355 0.0840 3.0601 4.3682 1.3050 1.6491 0.0810 2.6347 8.3892 9.3694 3.2337 2.3043 10.4590 6.6577 0.1029 3.7116 1.8304 7.1199 24.5855 2.5348 35.8509 5.5663 1.4819 21.8524 0.3475 32.6733 20.3830 1.8202 7.9035 4.1370 2.0148 54.1642 1.3154 88.5139 36.1678 0.2634 11.8767 5.6176 19.5190 101.1895 2.4376 6.5543 2.2968 80.9895 144.5428 14.5990 134.8061 0.7427 44.4581 45.8657 200.5324 9.1886 1.3392 0.3716 9.5535 3.1861 18.9786 7.1483 0.3173 21.5505 23.9703 6.3911 7.5775 21.1205 16.6745 2.0843 11.9106 9.9480 5.5712 16.2435 9.0965 494.9212 184.2536 45.7783 182.7864 40.9061 30.5701 29.4131 11.0181 10.8888 34.0156 63.7855 37.7119 2.2890 13.5586 98.6750 4.3753 10.2135 2.6021 21.4166 21.5889
temp: 298.150 k
press: 1.00000 atm
elementType: 8 8 8 7 7 6 6 6 6 6 6 6 6 6 6 6 1 1 1 1 1 1 1 1 1 1 1 1 1 1 1 1 1 1
symmnumber: 1
zpe: 745433.3 jmol-1
zpe.correction: 0.283921 hartree
zpe.thermalcorrener: 0.299292 hartree
zpe.thermalcorrenthalpy: 0.300236 hartree
zpe.thermalcorrgfe: 0.240849 hartree
zpe.sumelectzpe: -763.916251 hartree
zpe.sumelectthermal: -763.900879 hartree
zpe.sumelectthermalent: -763.899935 hartree
zpe.sumelectthermalfe: -763.959322 hartree
dipole: -0.4861 -1.9657 -0.3367
dipole: 2.0528
quadrupole: -83.0638 -111.1434 -92.7058
quadrupole: -4.4542 1.8115 -6.4356
quadrupole: 12.5739 -15.5058 2.9319 -4.4542 1.8115 -6.4356
hfenergy: -764.2001712 hartree
pointgroup: C01 [X(C11H18N2O3)]
dipole: -0.3136691 -0.4993994 -0.5517793 debye
polarizability: 155.5811526|-11.7770842|131.5982077|-4.3742829|14.9951277|124.8697225 unknown
InChI: InChI=1S/C11H18N2O3/c1-11(2)9(14)13(10(15)16-11)8-12-6-4-3-5-7-12/h3-8H2,1-2H3
charge 0 multiplicity 1
34 atoms
O  2.600599 0.101213 1.103042
O  1.052394 -1.164696 -1.920318
O  1.18064 1.890509 1.643618
N  -1.613426 0.597371 -0.150528
N  0.842009 0.550448 -0.295033
C  -2.376476 1.43819 0.800357
C  -2.438765 -0.290095 -1.001642
C  -3.278687 0.563912 1.696989
C  -3.338913 -1.19354 -0.132875
C  -4.189585 -0.3454 0.8400
C  -0.438858 1.180935 -0.75858
C  2.656103 -0.931794 -0.005643
C  1.436592 -0.569056 -0.884335
C  1.498601 0.951996 0.897025
C  2.496253 -2.321984 0.626606
C  3.977517 -0.751184 -0.766565
H  -3.019277 2.177334 0.257024
H  -1.657834 2.004675 1.419073
H  -1.763747 -0.904789 -1.623739
H  -3.088274 0.305775 -1.693335
H  -3.884331 1.217851 2.353402
H  -2.635955 -0.061444 2.346466
H  -2.696227 -1.885368 0.445787
H  -3.987155 -1.805161 -0.7894
H  -4.802455 -0.999211 1.488669
H  -4.894584 0.284651 0.257631
H  -0.435832 1.054912 -1.85745
H  -0.345119 2.253481 -0.510895
H  1.563109 -2.387532 1.211401
H  2.467521 -3.086064 -0.169415
H  3.347358 -2.529083 1.296805
H  4.827815 -0.969004 -0.098826
H  4.005201 -1.444118 -1.625367
H  4.081989 0.280468 -1.143453
