program: Gaussian 09
title: 000016823
version: EM64L-G09RevD.01
frameworkgroup: C1[X(C8H10O4)]
method: RPBEPBE
basis: SDD
operation: Freq
keyword: #pfreq=noraman
keyword: PBEPBE/SDD
title: #p freq=noraman PBEPBE/SDD
converged: YES YES NO NO
title: Mulliken charges:
elementType: O O O O C C C C C C C C H H H H H H H H H H
charge: -0.431409 -0.431421 -0.220535 -0.220518 -0.199513 -0.199526 -0.476142 -0.476125 -0.191922 -0.191921 0.147614 0.147616 0.295645 0.295626 0.235780 0.249526 0.235772 0.249518 0.207916 0.207917 0.383050 0.383050
chargesum: 0.00000
title: Mulliken charges with hydrogens summed into heavy atoms:
elementType: O O O O C C C C C C C C
charge: -0.048359 -0.048371 -0.220535 -0.220518 0.096131 0.096100 0.009165 0.009165 0.015994 0.015997 0.147614 0.147616
polarizability: 9.63652038e+01 -3.00327329e-03 8.21218364e+01 -3.66393523e+00 -6.93936564e-04 9.34942659e+01
1716.lowfreq: -9.2260 -0.0010 -0.0009 -0.0007 11.4704 23.3021 38.6688 41.1018 85.5241
frequency: 38.5676 41.1013 85.4814 92.0663 154.7500 208.7102 286.2100 313.3799 373.7475 389.3652 448.1619 469.6792 482.3328 558.4591 569.5936 622.6888 630.2458 660.7388 668.1562 691.0083 795.1686 795.2966 860.0443 902.5592 921.6468 929.2990 973.7213 1001.4826 1002.2458 1043.8183 1069.0661 1078.6193 1137.8739 1145.5802 1193.5358 1208.4674 1237.5533 1253.1427 1275.1889 1292.9826 1308.9823 1330.4340 1339.9309 1354.1022 1380.6876 1455.3574 1457.1431 1659.2145 1662.8030 1682.1157 2983.5246 2984.6051 3000.3056 3007.5894 3040.1522 3040.4972 3104.9567 3135.7945 3513.3129 3513.3431
redmass: 8.6184 11.0415 5.5125 3.6271 4.3773 4.6250 2.8042 5.0881 2.9140 3.5067 4.3548 3.9156 3.0874 4.3123 3.6392 1.5030 1.6191 1.2203 2.8155 3.5944 2.8543 3.8326 3.2041 2.4444 2.4108 5.1308 1.2393 2.5284 2.9805 2.4426 1.8871 1.5745 1.1468 1.6336 1.0850 1.0947 1.3555 1.8755 1.6057 1.6543 1.8735 1.9592 1.4769 1.6169 1.6467 1.0993 1.0725 8.9513 8.9380 6.4593 1.0638 1.0645 1.0791 1.0816 1.0970 1.0969 1.0843 1.0995 1.0640 1.0640
irintensity: 1.4509 1.5562 0.0910 0.0017 0.1988 0.0028 6.9996 0.8956 1.6420 1.0976 19.7388 11.3759 29.6452 14.0893 24.6493 74.4200 97.9454 99.7871 89.2483 9.6540 0.2514 12.1605 7.5827 30.1314 4.3271 26.3460 2.0854 46.7595 49.9810 217.6615 120.8509 56.7812 1.3639 10.6742 0.0007 24.5685 0.1137 2.5566 5.6412 19.7139 30.1246 13.0208 3.1599 3.1327 2.2983 1.1346 43.2291 51.3771 363.5660 8.9261 0.3816 54.5138 13.2736 8.2716 13.4928 0.3670 6.1586 46.8435 8.3858 42.5082
temp: 298.150 k
press: 1.00000 atm
elementType: 8 8 8 8 6 6 6 6 6 6 6 6 1 1 1 1 1 1 1 1 1 1
symmnumber: 1
zpe: 447741.8 jmol-1
zpe.correction: 0.170536 hartree
zpe.thermalcorrener: 0.181817 hartree
zpe.thermalcorrenthalpy: 0.182761 hartree
zpe.thermalcorrgfe: 0.132192 hartree
zpe.sumelectzpe: -610.836753 hartree
zpe.sumelectthermal: -610.825472 hartree
zpe.sumelectthermalent: -610.824527 hartree
zpe.sumelectthermalfe: -610.875097 hartree
dipole: 0.0002 -1.4304 0.0001
dipole: 1.4304
quadrupole: -77.5742 -66.2417 -65.0489
quadrupole: -0.0016 10.5790 0.0013
quadrupole: -7.9526 3.3799 4.5727 -0.0016 10.5790 0.0013
hfenergy: -611.0072889 hartree
pointgroup: C01 [X(C8H10O4)]
dipole: 0.0000875 0.5627762 0.0000832 debye
dipolederiv: -0.3315778 0.1502659 0.1269281 0.0908345 -0.7172264 -0.3751359 0.0754898 -0.4077624 -0.8667341 -0.3316404 -0.1503628 0.1268936 -0.0909522 -0.7171613 0.3749832 0.0754453 0.4078595 -0.866682 -0.9412303 -0.1413729 -0.2673743 -0.042847 -0.4566695 -0.1769118 -0.013015 -0.1973046 -0.5298677 -0.9411708 0.1415407 -0.2673039 0.0432442 -0.4567966 0.1771482 -0.0128003 0.1971879 -0.5297082 -0.1856942 0.06059 0.0549351 -0.1350756 0.0761906 0.001238 0.1782104 -0.0331102 -0.032607 -0.1857635 -0.0604901 0.0549385 0.134958 0.0761604 -0.001176 0.1781104 0.033091 -0.0326072 0.0916302 -0.0058808 -0.0182997 0.0036189 0.0026858 0.0090991 -0.1261851 0.0526581 0.0011308 0.0916691 0.0058936 -0.0182806 -0.0035795 0.0027193 -0.009109 -0.1262138 -0.0526216 0.0011602 -0.2131287 -0.0007861 0.0662721 -0.0127221 0.1472868 -0.0887575 0.0915866 -0.0610443 0.0311061 -0.2131241 0.0008317 0.0662966 0.0127608 0.1472382 0.0887692 0.0916281 0.0610671 0.0311101 1.2563915 -0.0297266 0.0686375 0.0351453 0.6603387 0.5608537 -0.1344305 0.6293201 0.9485027 1.2563551 0.0294112 0.0684999 -0.0355535 0.6604186 -0.5609037 -0.1346367 -0.6292916 0.9483422 0.1129275 0.0215222 0.0027624 0.0542952 -0.0301166 0.0479176 -0.0112529 0.0671153 0.0552618 0.1129176 -0.0215469 0.002762 -0.054289 -0.0300876 -0.0479716 -0.0112667 -0.067149 0.0552192 -0.0226281 0.0013109 0.1422118 0.021596 0.0258784 0.0826751 0.1066952 0.0201544 -0.0075141 0.0093275 -0.0269253 -0.1422015 -0.024229 0.0503731 0.0183066 -0.0896276 -0.000537 0.0353895 -0.0226575 -0.001328 0.1421951 -0.0216017 0.0259077 -0.082691 0.1066776 -0.02018 -0.0075442 0.0093297 0.0269497 -0.1422116 0.0242491 0.0503513 -0.0182588 -0.0896291 0.0005597 0.0353665 0.1440901 -0.0204677 -0.0416071 -0.0019378 -0.1305881 -0.0751975 -0.0395619 -0.0822396 0.0289124 0.1440928 0.0204339 -0.0415933 0.0018941 -0.1306317 0.0751603 -0.0395476 0.0821947 0.0289623 0.079932 0.0016279 0.0077394 -0.0541328 0.3718656 -0.0113931 -0.0378954 -0.0229744 0.3364118 0.0799523 -0.0014904 0.0078 0.0543239 0.3718633 0.0113548 -0.0377808 0.0230068 0.3363891 unknown
polarizability: 96.0706701|-0.0073371|82.1218395|3.7660654|-0.0012929|93.7887965 unknown
InChI: InChI=1S/C8H10O4/c9-7(10)5-3-1-2-4-6(5)8(11)12/h1-2,5-6,9,11H,3-4H2
charge 0 multiplicity 1
22 atoms
O  -2.036709 1.491294 1.038712
O  2.037003 1.490614 -1.038477
O  -2.977009 0.211036 -0.64527
O  2.977121 0.209661 0.645087
C  -0.511486 0.508519 -0.587875
C  0.511673 0.508231 0.58825
C  -0.368747 -0.751431 -1.476665
C  0.368633 -0.751917 1.476709
C  -0.157116 -2.013807 -0.66087
C  0.156773 -2.014029 0.660557
C  -1.950742 0.669959 -0.101289
C  1.950952 0.669403 0.101614
H  -0.314994 1.40508 -1.209234
H  0.315447 1.404692 1.20983
H  0.475442 -0.607083 -2.180168
H  -1.278526 -0.856784 -2.096473
H  -0.475559 -0.607567 2.180206
H  1.278365 -0.857639 2.096521
H  -0.27367 -2.967972 -1.191509
H  0.273164 -2.968372 1.19091
H  -2.995961 1.613152 1.275693
H  2.996245 1.611958 -1.275762
