program: Gaussian 09
title: 000201877
version: EM64L-G09RevD.01
frameworkgroup: C1[X(C6H10O5)]
method: RPBEPBE
basis: SDD
operation: Freq
keyword: #pfreq=noraman
keyword: PBEPBE/SDD
title: #p freq=noraman PBEPBE/SDD
converged: NO YES NO NO
title: Mulliken charges:
elementType: O O O O O C C C C C C H H H H H H H H H H
charge: -0.230834 -0.278422 -0.278423 -0.192608 -0.192608 -0.321985 -0.321983 0.226306 0.226305 -0.497925 -0.497925 0.228199 0.228062 0.228233 0.228028 0.244660 0.234409 0.244722 0.244650 0.234409 0.244731
chargesum: 0.00000
title: Mulliken charges with hydrogens summed into heavy atoms:
elementType: O O O O O C C C C C C
charge: -0.230834 -0.278422 -0.278423 -0.192608 -0.192608 0.134277 0.134278 0.226306 0.226305 0.225865 0.225865
polarizability: 1.13766744e+02 1.15283504e-04 7.78146365e+01 5.98912117e-02 7.81981711e-04 5.43216638e+01
1716.lowfreq: -9.7266 -2.5184 0.0009 0.0010 0.0011 2.1334 3.8540 18.7371 64.9388
frequency: -9.7259 18.6005 64.9175 65.5812 85.5564 89.4083 92.0142 162.4372 164.2199 169.1887 230.2958 272.9307 298.3055 384.0885 479.2500 552.8664 560.6734 644.7774 676.5128 831.8667 851.8930 935.6717 950.8099 983.4056 998.6756 1013.7798 1099.6847 1113.9827 1114.0106 1126.3382 1136.0745 1149.3704 1149.6795 1190.4578 1204.2794 1335.4729 1392.8343 1423.7671 1424.6657 1439.8456 1453.2478 1453.2650 1464.7686 1465.5746 1465.8188 1683.9437 1690.2045 2928.1821 2934.9005 2974.0547 2979.8857 3005.9917 3006.1147 3108.3459 3108.3787 3150.7948 3150.8251
redmass: 8.1306 3.2509 3.6270 4.9611 1.5883 1.0906 1.4611 3.6877 2.8444 4.8481 7.6393 3.8774 5.4768 6.9724 5.6616 3.1149 3.4856 5.6754 4.7697 6.1678 6.1187 5.5862 7.1347 1.8965 6.9015 1.9550 11.5543 1.2619 1.2620 3.7935 5.0063 1.4318 1.4362 1.0550 1.1035 1.4415 1.4943 1.1751 1.1968 1.0722 1.0497 1.0497 1.0820 1.0506 1.0587 10.0701 10.4111 1.0554 1.0547 1.1015 1.1042 1.0295 1.0295 1.1047 1.1048 1.1049 1.1049
irintensity: 0.0001 0.3142 19.1267 1.6790 0.0000 0.0549 0.0000 17.7743 0.0005 1.2495 1.2377 2.8597 33.0213 0.0209 0.2131 0.0005 13.5740 1.5242 20.8132 6.9976 29.3707 7.3362 11.6316 0.0001 1.1997 0.3563 729.9874 0.0002 0.0625 187.8573 14.2337 4.0228 0.2188 0.0000 4.4522 16.7016 0.0112 24.5579 11.7936 17.0418 0.0231 29.3389 31.4918 11.4961 3.1103 26.7508 323.3282 50.3240 40.8531 64.5178 0.0017 58.9433 4.6717 0.0029 53.4934 10.7305 20.8471
temp: 298.150 k
press: 1.00000 atm
elementType: 8 8 8 8 8 6 6 6 6 6 6 1 1 1 1 1 1 1 1 1 1
symmnumber: 1
zpe: 418109.7 jmol-1
zpe.correction: 0.159250 hartree
zpe.thermalcorrener: 0.171897 hartree
zpe.thermalcorrenthalpy: 0.172841 hartree
zpe.thermalcorrgfe: 0.117819 hartree
zpe.sumelectzpe: -609.838523 hartree
zpe.sumelectthermal: -609.825876 hartree
zpe.sumelectthermalent: -609.824932 hartree
zpe.sumelectthermalfe: -609.879954 hartree
dipole: 0.0000 -4.4479 0.0018
dipole: 4.4480
quadrupole: -36.6099 -72.7964 -61.8599
quadrupole: 0.0001 0.0297 0.0032
quadrupole: 20.4788 -15.7077 -4.7712 0.0001 0.0297 0.0032
hfenergy: -609.9977731 hartree
pointgroup: C01 [X(C6H10O5)]
dipole: -0.0003635 1.7499581 0.0010327 debye
dipolederiv: -1.169591 -0.0001923 0.000391 -0.0001925 -0.2731445 0.0000637 0.0002333 0.0000374 -0.3968746 -1.5230007 -0.1831916 0.0036346 -0.3133427 -0.5993009 0.002357 0.0039893 0.0017431 -0.3041236 -1.5232032 0.1827874 0.0046973 0.3129322 -0.5990829 -0.0026741 0.0060193 -0.0022874 -0.3041378 -0.6231828 0.1153728 0.0002367 -0.2405152 -0.8756843 0.0032364 0.0022998 0.0029203 -0.2839271 -0.6232348 -0.1152649 0.0003496 0.2406224 -0.875625 -0.0043028 0.002488 -0.0026658 -0.2839312 0.5671765 0.2050268 0.0001944 0.5718721 0.0958768 0.0001172 0.0011031 -0.0000745 0.4331332 0.567505 -0.2048242 0.0002413 -0.5716655 0.0955464 -0.0003687 0.0003334 -0.0003786 0.4331331 1.6087886 0.0979929 -0.0041643 0.4808477 1.2370242 -0.0058445 -0.0068789 -0.0049166 0.1933419 1.6090275 -0.0978261 -0.0051764 -0.4806791 1.2367617 0.0073644 -0.0083012 0.0055962 0.1933591 0.6542453 -0.017584 -0.0006115 -0.1441993 0.2246407 0.0004663 0.0001128 0.0003275 0.2797668 0.6541732 0.0177705 -0.0010318 0.1443867 0.2247115 -0.0006628 -0.000248 -0.0003648 0.2797673 -0.0330013 0.0066954 -0.0086803 -0.1023388 -0.0049112 0.0927952 0.0357531 0.1168931 -0.0651196 -0.0335242 0.0069236 0.0087321 -0.1022834 -0.0051525 -0.0926829 -0.0361076 -0.1168498 -0.0650944 -0.0331155 -0.0067268 -0.0086313 0.1022863 -0.0047156 -0.0927023 0.0358912 -0.1167902 -0.0651796 -0.0334912 -0.0069182 0.0087028 0.1023111 -0.005267 0.0927834 -0.0360688 0.1169226 -0.0650341 0.0070154 -0.0012498 0.020244 0.0961296 0.0388201 0.0987739 -0.0360553 0.0882865 -0.0569114 -0.0468824 -0.0771858 0.0006861 -0.1235838 -0.0117002 0.0008671 0.0008854 0.0007801 0.1224231 0.0070836 -0.0017665 -0.02038 0.0961433 0.0370386 -0.1000232 0.0348692 -0.0891714 -0.0550513 0.0070445 0.0010725 0.0201602 -0.0962875 0.0389125 -0.0985916 -0.0362061 -0.0882432 -0.0570445 -0.0469676 0.0771688 0.0009525 0.1235652 -0.0116107 -0.0011559 0.001244 -0.0010058 0.1224189 0.0071352 0.0019193 -0.0205471 -0.0960089 0.0368624 0.1001843 0.0346441 0.0892413 -0.054914 unknown
polarizability: 113.7665406|0.007874|77.8146377|-0.1248036|0.0035549|54.321866 unknown
InChI: InChI=1S/C6H10O5/c1-9-5(7)3-11-4-6(8)10-2/h3-4H2,1-2H3
charge 0 multiplicity 1
21 atoms
O  0.000041 -0.059493 -0.000974
O  3.558393 0.683891 -0.00776
O  -3.558629 0.682359 0.007988
O  2.462463 -1.380642 0.005018
O  -2.461818 -1.381693 -0.006541
C  1.195741 0.767409 -0.001638
C  -1.196011 0.766899 0.000237
C  2.421458 -0.138937 -0.001345
C  -2.421344 -0.139968 -0.000617
C  4.859107 -0.029233 -0.006523
C  -4.859033 -0.031333 0.008213
H  1.244644 1.424346 -0.898122
H  1.245024 1.425004 0.894425
H  -1.24515 1.42327 0.897127
H  -1.245614 1.425018 -0.895419
H  4.948462 -0.658017 0.895077
H  5.615813 0.767349 -0.01171
H  4.945318 -0.666728 -0.902283
H  -4.949482 -0.659478 -0.893724
H  -5.616078 0.764913 0.015149
H  -4.943604 -0.669539 0.903622
