program: Gaussian 09
title: 000201960
version: EM64L-G09RevD.01
frameworkgroup: C1[X(C18H27N7)]
method: RPBEPBE
basis: SDD
operation: Freq
keyword: #pfreq=noraman
keyword: PBEPBE/SDD
title: #p freq=noraman PBEPBE/SDD
converged: YES YES NO NO
title: Mulliken charges:
elementType: N N N N N N N C C C C C C C C C C C C C C C C C C H H H H H H H H H H H H H H H H H H H H H H H H H H H
charge: -0.080592 -0.175030 -0.138743 -0.105663 -0.130435 -0.141517 -0.585494 -0.360964 -0.355998 -0.408930 -0.383961 -0.388184 -0.141383 0.470782 -0.736189 0.062053 -0.378101 -0.381414 -0.235007 -0.226974 -0.270470 0.161245 -0.004344 -0.628720 -0.626864 0.187726 0.210261 0.209458 0.183087 0.209838 0.213881 0.202749 0.214262 0.199040 0.223326 0.234844 0.242455 0.215164 0.224757 0.230405 0.214748 0.216826 0.217154 0.224057 0.219611 0.219154 0.288847 0.219686 0.220512 0.287245 0.327614 0.334188
chargesum: 0.00000
title: Mulliken charges with hydrogens summed into heavy atoms:
elementType: N N N N N N N C C C C C C C C C C C C C C C C C C
charge: -0.080592 -0.175030 -0.138743 -0.105663 -0.130435 -0.141517 0.076308 0.037023 0.036547 0.014789 0.033051 0.034183 0.093462 0.470782 -0.053813 0.062053 -0.147696 -0.166666 -0.018181 -0.009820 -0.046413 0.161245 -0.004344 0.098892 0.100579
polarizability: 3.57300068e+02 -1.27102442e+01 2.56953745e+02 -6.40087144e+00 5.25548860e+00 1.57258109e+02
1716.lowfreq: -0.0008 -0.0002 0.0006 2.7604 4.3656 10.2708 13.7444 18.8041 27.8142
frequency: 13.4802 18.6667 26.7393 46.1427 54.1008 60.8645 83.9164 94.1094 109.6349 132.1518 133.7393 143.0465 159.9542 180.7864 190.8764 199.1531 219.2930 227.0937 244.5832 249.4006 263.7057 288.2879 312.2782 322.3238 343.8975 355.3769 387.6015 405.3928 409.3354 432.8310 465.1908 478.4086 480.4607 514.0503 518.2346 526.0253 549.6671 554.5006 593.0735 614.0232 617.4385 668.9753 690.5216 703.6177 715.2360 717.3487 755.3251 783.4981 813.1617 817.8523 843.2858 849.3802 871.5422 878.6403 900.7910 906.0131 924.5472 955.0928 961.1970 965.5533 974.6107 977.3771 997.1147 1006.1646 1032.1489 1037.3032 1053.2180 1056.0198 1063.4928 1085.1755 1087.9570 1090.3740 1100.5184 1106.9625 1115.7879 1142.6468 1150.9607 1158.4705 1170.4142 1190.8294 1200.5337 1207.4386 1221.4918 1237.1706 1240.2498 1246.4334 1255.1941 1289.9076 1294.6079 1301.9901 1322.8484 1327.2121 1340.8116 1345.5241 1358.7853 1360.6735 1362.3273 1375.7699 1379.4733 1385.1269 1392.9332 1410.7070 1414.4272 1430.4997 1446.0360 1452.9192 1458.7081 1460.7786 1461.7517 1467.2047 1469.6784 1471.0590 1477.5962 1478.6211 1481.9102 1483.3071 1492.9025 1497.0105 1522.2495 1569.0469 1577.9686 1614.2849 1618.4255 2848.9909 2853.3203 2869.5145 2909.4743 2919.8572 2959.7121 2965.4361 2983.7343 3024.9774 3031.2711 3033.5243 3033.6612 3043.3894 3046.7862 3057.4236 3084.4888 3091.6663 3092.7163 3119.9171 3126.0770 3126.6662 3128.2166 3150.8470 3159.0489 3169.6891 3554.5527 3715.4866
redmass: 4.4016 4.9737 3.6157 4.1687 3.6608 3.0863 3.7756 3.2073 1.9088 3.1765 1.0789 4.1297 1.9199 3.2472 4.1853 4.5381 1.1966 2.9722 2.5108 2.3665 2.9275 2.9686 3.2565 3.4293 3.0967 2.5905 2.3515 2.5445 2.9461 3.5240 2.7165 2.9741 1.2211 3.3375 3.7473 4.3004 1.0447 4.4115 5.4285 5.8099 2.7851 3.4146 1.7941 6.9272 10.9061 4.0600 1.8912 3.7249 2.0180 2.6689 1.5801 3.3300 1.5114 2.8680 3.0135 2.9488 3.0012 1.3797 1.9410 2.2412 1.3173 5.1982 2.8678 2.5719 2.1494 1.9821 1.7714 1.3910 2.2229 2.1397 1.8674 1.8268 1.2223 2.6208 2.0073 2.6580 1.3682 3.2938 1.0670 2.0853 1.1486 1.2685 4.1583 2.8565 1.6085 3.8044 1.3925 1.4706 1.5560 1.4757 1.3323 1.3726 1.3876 1.4460 1.9849 1.5956 1.5687 1.8627 1.8251 2.9965 1.4355 1.3069 1.2167 2.3243 2.4535 1.0841 1.1143 2.4672 1.1056 1.1657 1.0531 1.1547 1.2017 1.3768 1.0969 1.0551 1.0457 2.3795 3.3958 2.4245 5.8775 1.9989 5.7996 1.0714 1.0702 1.0696 1.0691 1.0709 1.0367 1.0373 1.0342 1.0842 1.1010 1.1012 1.0895 1.0890 1.0887 1.0899 1.0998 1.0891 1.1002 1.0843 1.0962 1.0887 1.0961 1.0918 1.0941 1.0986 1.0441 1.1058
irintensity: 0.0963 0.0368 0.0510 0.6981 0.3292 1.6720 0.3414 1.2136 3.2989 0.7729 0.2951 1.9915 1.0987 6.4345 3.0886 1.7697 0.2624 8.5353 1.3331 1.2026 3.2806 8.5752 3.7938 2.2039 0.3557 6.1645 6.8332 5.9859 0.8411 1.5048 4.5906 1.3578 284.8167 16.0445 3.5126 0.3408 0.0100 4.2923 5.7412 0.4829 3.5248 7.1220 41.5545 11.0287 2.5402 5.3322 77.1547 0.4590 5.0483 14.1343 0.2398 1.9647 6.0005 6.7423 10.9216 6.4953 36.1127 0.0917 32.9327 73.2296 0.4309 8.8680 19.0259 101.0325 7.7809 50.0831 9.4713 7.4672 2.7286 1.3992 5.6430 25.1862 0.1337 1.4003 40.1894 84.8002 0.0401 19.1856 0.1458 9.0494 0.5076 6.3173 54.9918 76.5576 119.3662 47.8684 15.5527 4.0176 18.9525 34.4789 8.9149 1.1571 3.1068 4.0474 32.7881 34.0742 1.5503 45.6395 19.6388 16.3389 4.0162 65.3343 42.5387 37.0542 1.8331 4.4543 8.7092 327.3346 69.1523 3.2936 27.4729 51.2993 58.2513 145.3958 61.3406 6.3418 35.4152 123.8167 418.1244 668.5066 10.3420 351.6281 144.5228 45.9591 39.0800 144.6355 57.3382 107.2788 30.4643 191.9720 29.8821 3.1311 79.8959 1.0367 24.4635 44.9099 31.2434 25.8473 29.4833 21.0560 26.5189 9.5619 1.2371 12.2285 1.6591 44.0005 40.4923 4.5319 101.5242 45.0006
temp: 298.150 k
press: 1.00000 atm
elementType: 7 7 7 7 7 7 7 6 6 6 6 6 6 6 6 6 6 6 6 6 6 6 6 6 6 1 1 1 1 1 1 1 1 1 1 1 1 1 1 1 1 1 1 1 1 1 1 1 1 1 1 1
symmnumber: 1
zpe: 1152261.0 jmol-1
zpe.correction: 0.438873 hartree
zpe.thermalcorrener: 0.463671 hartree
zpe.thermalcorrenthalpy: 0.464615 hartree
zpe.thermalcorrgfe: 0.382004 hartree
zpe.sumelectzpe: -1083.493377 hartree
zpe.sumelectthermal: -1083.468579 hartree
zpe.sumelectthermalent: -1083.467635 hartree
zpe.sumelectthermalfe: -1083.550247 hartree
dipole: 4.2161 -0.4793 -0.9489
dipole: 4.3481
quadrupole: -139.1340 -129.5001 -154.8660
quadrupole: -0.9058 -6.8926 0.5529
quadrupole: 2.0327 11.6666 -13.6993 -0.9058 -6.8926 0.5529
hfenergy: -1083.9322504 hartree
pointgroup: C01 [X(C18H27N7)]
dipole: -1.6559041 -0.1909373 0.3845364 debye
polarizability: 356.9263932|13.7289065|256.4494699|-7.1162131|-10.7452629|158.1360594 unknown
InChI: InChI=1S/C18H27N7/c1-14(16-20-17(19)22-18(21-16)23(2)3)13-24-9-11-25(12-10-24)15-7-5-4-6-8-15/h4-8,14H,9-13,19H2,1-3H3
charge 0 multiplicity 1
52 atoms
N  0.77185 -0.25288 -0.27733
N  3.646135 -0.088235 0.094837
N  -3.657435 -0.579151 -0.317855
N  -3.445573 1.828207 -0.119455
N  -5.679458 -1.620953 0.330255
N  -5.530404 0.726314 0.539565
N  -5.266779 3.047517 0.704696
C  1.42561 1.026379 0.084056
C  1.526003 -1.377312 0.325303
C  2.883506 1.070266 -0.408719
C  2.975903 -1.37899 -0.186552
C  -0.671395 -0.280898 0.060242
C  -1.541298 0.506135 -0.965161
C  5.059819 -0.02206 0.169433
C  -1.476818 -0.148905 -2.36459
C  -2.966093 0.589976 -0.445617
C  5.782749 1.124454 -0.285088
C  5.816772 -1.090749 0.744846
C  7.185657 1.199144 -0.150842
C  7.21732 -1.007473 0.863863
C  7.921209 0.138291 0.421915
C  -4.942237 -0.466449 0.181593
C  -4.74044 1.826451 0.367433
C  -5.133471 -2.933266 -0.040339
C  -7.048493 -1.594976 0.86161
H  1.416204 1.180346 1.194073
H  0.873074 1.864142 -0.377053
H  1.040572 -2.327445 0.035461
H  1.535025 -1.316893 1.444029
H  2.892982 1.108008 -1.522981
H  3.342288 1.998605 -0.027246
H  3.524968 -2.203117 0.293403
H  2.962806 -1.570608 -1.284129
H  -0.858104 0.122029 1.087536
H  -1.013887 -1.332219 0.056442
H  -1.180088 1.548634 -1.026852
H  -0.42022 -0.28324 -2.654291
H  -1.981251 0.477599 -3.122117
H  -1.972596 -1.135713 -2.345228
H  5.259157 1.954803 -0.767258
H  5.309717 -1.981032 1.130091
H  7.706555 2.093696 -0.512788
H  7.76266 -1.843438 1.317996
H  9.010065 0.198803 0.519417
H  -5.767821 -3.408974 -0.813708
H  -5.099387 -3.601515 0.842553
H  -4.117043 -2.792626 -0.433739
H  -7.117362 -2.21254 1.778583
H  -7.760271 -1.999255 0.115271
H  -7.316847 -0.555853 1.097506
H  -6.215539 3.10201 1.06536
H  -4.692791 3.877357 0.580075
