program: Gaussian 09
title: 000201837
version: EM64L-G09RevD.01
frameworkgroup: C1[X(C15H21NO)]
method: RPBEPBE
basis: SDD
operation: Freq
keyword: #p
keyword: freq=noraman
keyword: PBEPBE/SDD
title: #p freq=noraman PBEPBE/SDD
converged: YES YES NO NO
title: Mulliken charges:
elementType: O N C C C C C C C C C C C C C C C H H H H H H H H H H H H H H H H H H H H H
charge: -0.230453 -0.083875 -0.414316 -0.412830 -0.536655 -0.536794 0.268285 0.296303 -0.524941 -0.407568 0.293410 -0.369661 0.104484 -0.524428 -0.363622 -0.615621 -0.620503 0.205486 0.210957 0.206375 0.210016 0.229729 0.221423 0.225545 0.223578 0.279784 0.233722 0.246915 0.235071 0.251673 0.193146 0.236895 0.218304 0.187891 0.228865 0.187298 0.220627 0.225484
chargesum: 0.00000
title: Mulliken charges with hydrogens summed into heavy atoms:
elementType: O N C C C C C C C C C C C C C C C
charge: -0.230453 -0.083875 0.002127 0.003561 -0.085503 -0.087671 0.268285 0.296303 -0.245156 -0.173845 0.293410 -0.122747 0.104484 -0.037684 0.066419 0.019439 0.012906
polarizability: 2.50915615e+02 -7.22732262e+00 1.67055473e+02 -8.82579139e-01 -4.19185298e+00 1.07459544e+02
1716.lowfreq: -16.3234 -4.9229 -0.0007 -0.0001 0.0006 0.9372 19.7908 30.4030 61.5826
frequency: 19.6728 30.3130 61.5529 68.3326 74.6568 106.0608 123.2142 168.0735 174.8835 198.1820 234.0130 247.7867 281.7451 286.5306 302.5338 336.9137 344.9595 408.5582 425.9664 433.5973 444.4963 470.8371 494.9886 523.3409 579.6098 606.6524 611.5181 708.7516 724.8048 728.6105 787.1296 819.2271 826.2682 840.5405 859.1398 874.4052 897.0210 936.9835 952.9365 967.6591 989.2259 1007.1860 1029.5877 1034.7215 1041.8015 1083.0297 1083.9750 1091.9679 1095.9314 1128.0730 1133.4840 1138.9307 1154.8338 1161.7759 1165.5388 1210.8301 1217.1103 1231.0604 1248.3093 1250.5202 1264.5088 1281.3853 1294.9276 1307.4811 1328.9808 1333.7272 1344.0563 1353.4092 1373.4975 1385.4386 1415.4467 1419.7299 1433.4196 1443.0746 1450.3525 1456.2003 1462.0341 1463.9090 1469.8818 1473.9068 1474.4763 1477.9685 1485.7892 1496.3275 1564.4841 1586.8236 1619.5029 2845.2695 2856.1406 2874.1980 2957.1956 2961.3864 2973.2548 2979.7651 2981.2743 3018.7026 3019.5850 3021.9062 3026.0041 3026.1136 3042.9064 3050.4444 3053.5446 3077.3717 3081.3159 3115.4707 3130.1904 3154.0754
redmass: 3.7865 2.9232 4.1810 3.9470 2.9909 2.1691 2.2518 3.9422 3.2304 3.5007 1.1373 1.2000 2.8187 3.1405 1.8708 3.8364 2.5803 2.8640 2.4852 3.4492 2.4962 3.1516 3.2282 4.2745 2.9151 3.6161 2.7365 2.9013 4.6707 4.2690 1.3788 1.6813 2.9753 1.5551 3.1159 2.6671 1.4663 2.7043 1.3944 1.3656 2.6038 2.7346 1.6002 1.9159 2.3110 1.8412 1.7295 1.7134 1.6992 1.3182 1.1821 1.9779 1.6806 1.6812 1.3485 1.9384 1.9528 1.6362 1.2821 1.7937 2.6303 1.2141 1.2041 2.0986 1.4688 1.5451 1.3946 1.7249 1.4728 5.4503 3.2239 1.2112 1.1106 1.1605 1.1453 1.0860 1.0513 1.0776 1.0864 1.0959 1.0627 1.0614 1.0537 2.4748 7.2835 7.4694 7.0005 1.0572 1.0606 1.0672 1.0644 1.0651 1.0598 1.0658 1.0605 1.0729 1.0941 1.0896 1.0946 1.0771 1.0982 1.1042 1.0908 1.1008 1.1005 1.0886 1.0910 1.0945
irintensity: 0.2644 1.2065 0.6636 1.9331 1.2695 0.8931 1.1425 5.8016 0.4692 0.5623 0.5190 2.6857 5.0603 1.6351 1.3720 2.6337 8.7744 2.2238 6.6063 1.9423 0.5893 0.5876 1.7732 10.7885 0.4322 5.9478 5.7420 1.3163 6.0483 9.9368 24.2140 6.4781 26.1939 5.6418 8.6187 3.1010 4.2288 1.9390 13.7224 2.8044 41.7182 33.3002 1.8589 23.9103 8.6936 7.6438 3.2579 0.1270 6.2904 14.1545 1.0381 36.1188 4.3900 32.6981 18.9872 7.5106 3.9666 44.1348 3.6425 48.9255 2.6661 0.7990 4.8373 149.7917 6.3187 11.4842 2.1937 0.6133 31.4530 27.3023 46.4003 8.4198 11.5848 4.9969 1.0462 19.8326 17.8580 0.9763 12.2898 10.5991 6.1710 22.8940 16.4685 5.5005 85.8369 99.2339 10.0257 76.0501 116.4623 164.1079 24.1034 18.9097 32.7495 37.4259 30.4926 41.8561 41.4553 22.5837 15.5691 36.6735 72.4711 62.8079 21.8459 26.0109 67.6301 16.2382 4.2135 14.2192
temp: 298.150 k
press: 1.00000 atm
elementType: 8 7 6 6 6 6 6 6 6 6 6 6 6 6 6 6 6 1 1 1 1 1 1 1 1 1 1 1 1 1 1 1 1 1 1 1 1 1
symmnumber: 1
zpe: 856449.7 jmol-1
zpe.correction: 0.326204 hartree
zpe.thermalcorrener: 0.343318 hartree
zpe.thermalcorrenthalpy: 0.344262 hartree
zpe.thermalcorrgfe: 0.279880 hartree
zpe.sumelectzpe: -712.873544 hartree
zpe.sumelectthermal: -712.856430 hartree
zpe.sumelectthermalent: -712.855486 hartree
zpe.sumelectthermalfe: -712.919869 hartree
dipole: -2.0250 2.5561 0.5006
dipole: 3.2992
quadrupole: -85.2898 -103.9490 -105.0972
quadrupole: 2.8418 2.6271 0.9335
quadrupole: 12.8222 -5.8370 -6.9852 2.8418 2.6271 0.9335
hfenergy: -713.1997483 hartree
pointgroup: C01 [X(C15H21N1O1)]
dipole: -0.8058456 0.9976604 0.2003856 debye
polarizability: 251.0156787|-6.5959485|167.0508894|0.5863481|-3.5557429|107.3640639 unknown
InChI: InChI=1S/C15H21NO/c1-16(2)10-9-15(17)14-8-7-12-5-3-4-6-13(12)11-14/h7-8,11H,3-6,9-10H2,1-2H3
charge 0 multiplicity 1
38 atoms
O  1.514119 -1.985717 0.123988
N  5.042801 0.390826 -0.177772
C  -4.992215 -0.927804 -0.266382
C  -5.197945 0.483907 0.325376
C  -3.638509 -1.510114 0.197319
C  -4.112122 1.446603 -0.20308
C  -2.476632 -0.529632 0.045273
C  -2.702002 0.869911 -0.117648
C  -1.148592 -1.008461 0.088654
C  -1.584508 1.738159 -0.22495
C  -0.031403 -0.141503 -0.016599
C  -0.265885 1.251723 -0.174732
C  1.349102 -0.730582 0.040827
C  2.54958 0.219027 -0.0058
C  3.898494 -0.511452 0.10506
C  6.282675 -0.368021 -0.447115
C  5.252848 1.410492 0.870285
H  -5.017344 -0.865877 -1.372993
H  -5.813581 -1.60265 0.039353
H  -5.145709 0.426389 1.431168
H  -6.20051 0.873701 0.067404
H  -3.408226 -2.442735 -0.352155
H  -3.720129 -1.798181 1.266507
H  -4.150689 2.411696 0.338265
H  -4.331102 1.684089 -1.265808
H  -0.948098 -2.080409 0.207006
H  -1.760317 2.814161 -0.349227
H  0.571289 1.951678 -0.262624
H  2.431378 0.972782 0.797578
H  2.533931 0.784374 -0.960109
H  3.981517 -0.996379 1.110458
H  3.912094 -1.331316 -0.634597
H  7.089597 0.329791 -0.735573
H  6.640511 -0.963855 0.431317
H  6.116426 -1.065554 -1.287016
H  5.477021 0.96801 1.875455
H  6.099844 2.060484 0.586506
H  4.360091 2.051638 0.971283
