program: Gaussian 09
title: 000201817
version: EM64L-G09RevD.01
frameworkgroup: C1[X(C13H21N2)]
method: RPBEPBE
basis: SDD
operation: Freq
keyword: #p
keyword: freq=noraman
keyword: PBEPBE/SDD
title: #p freq=noraman PBEPBE/SDD
converged: YES YES NO NO
title: Mulliken charges:
elementType: N N C C C C C C C C C C C C C H H H H H H H H H H H H H H H H H H H H H
charge: -0.096002 -0.125108 -0.333789 -0.335182 -0.339890 -0.448283 -0.450216 -0.400181 -0.573864 -0.532130 0.233067 -0.296303 -0.173220 -0.362277 -0.160893 0.264662 0.259955 0.252647 0.302474 0.255402 0.297398 0.258011 0.235284 0.230009 0.254296 0.257377 0.215911 0.271579 0.256887 0.260822 0.271442 0.228745 0.248818 0.262069 0.255513 0.254969
chargesum: 1.00000
title: Mulliken charges with hydrogens summed into heavy atoms:
elementType: N N C C C C C C C C C C C C C
charge: -0.096002 -0.125108 0.190828 0.219939 0.212910 0.045011 0.034090 0.073107 0.215423 -0.031942 0.233067 -0.047485 0.088849 -0.106764 0.094076
polarizability: 1.72475278e+02 -7.73064379e+00 1.41624174e+02 1.13405439e+01 9.62275207e+00 1.10494169e+02
1716.lowfreq: -35.7519 -4.8613 -0.0008 -0.0008 -0.0007 4.2152 19.0795 38.8763 61.3079
frequency: 9.8720 38.0916 61.2509 130.7351 138.9077 163.9956 192.2854 220.5185 256.7308 260.9506 319.0928 334.0152 385.2173 405.2350 414.7385 444.3577 459.6019 469.9105 509.8637 548.3407 574.2867 621.6735 664.2152 733.2300 762.3235 766.1972 778.0714 820.0999 833.1284 856.7909 867.6700 902.0269 913.5263 930.3414 958.9737 968.6752 971.6375 983.3308 995.5683 1013.0153 1014.8435 1039.3014 1049.5794 1068.1948 1099.9964 1111.5398 1117.9809 1153.9493 1173.0504 1174.4677 1178.1851 1206.9403 1218.1352 1225.8760 1263.2006 1271.1958 1289.1025 1298.2624 1305.6847 1335.5989 1340.5656 1347.3829 1351.2059 1359.0614 1364.8421 1381.3479 1399.4123 1421.6823 1428.8432 1444.2754 1447.8784 1460.8777 1461.6151 1464.7139 1468.3710 1471.4952 1485.1827 1487.4860 1496.1749 1568.2465 1584.9944 2992.6318 2996.1490 3000.8942 3003.4512 3016.1089 3020.9995 3025.9276 3034.3396 3036.3879 3057.9007 3060.0445 3076.0570 3091.1472 3096.6536 3102.2502 3140.2567 3140.8903 3146.9227 3162.5987 3163.8613 3184.4688
redmass: 3.9702 3.1202 3.7220 1.4157 2.0418 4.1572 2.6722 2.6954 1.6705 3.0876 2.6660 1.7993 2.2706 3.1734 1.9766 2.5673 2.7480 2.6708 3.1691 1.8240 3.7652 6.8695 2.9981 3.4071 1.3100 2.2703 2.1521 3.0828 1.9423 1.8871 2.4006 1.5131 1.9140 1.5548 1.9598 3.1819 1.8938 2.0354 1.9707 1.3751 2.4065 2.5401 2.1535 2.6559 1.6565 1.9405 1.1768 1.9669 1.7301 1.0742 1.3716 1.4746 1.5756 1.4460 1.2450 1.2552 1.5333 1.3717 2.7966 1.2663 1.4573 1.3473 1.4415 1.5911 1.3518 1.3155 1.2820 2.0128 1.1585 1.0971 1.2112 1.3903 1.1708 1.0919 1.1357 1.0918 1.0676 1.0957 1.0624 5.9750 5.5231 1.0624 1.0683 1.0625 1.0620 1.0613 1.0639 1.0607 1.0373 1.0900 1.0985 1.0966 1.1011 1.1075 1.1064 1.1068 1.0900 1.1039 1.0906 1.1019 1.0946 1.1012
irintensity: 0.8261 0.3537 1.3048 0.4259 1.9747 6.8731 4.9145 3.3097 0.4600 2.1106 1.4934 0.8692 0.2207 6.7404 0.2270 4.1733 1.0779 3.0196 3.6167 1.9111 1.7120 1.9254 0.1682 4.4912 58.6596 13.5218 11.2717 9.9300 1.4689 32.7053 3.7329 6.9154 7.1536 25.9725 3.9118 6.7133 7.7468 15.3027 4.3902 0.1428 13.7889 1.1530 3.7116 1.2805 4.4071 0.3605 0.3677 2.6446 1.4099 2.5230 6.7757 0.5840 1.0226 6.7830 6.4246 2.1340 2.3208 12.9174 1.4148 6.7677 4.1072 1.4685 1.0256 2.2266 3.9336 4.6787 5.5136 21.3343 9.4414 16.8013 41.8098 15.5537 2.1160 7.7186 79.2909 15.2455 65.4846 2.4100 26.3542 8.3935 39.8752 7.6258 8.8910 17.5029 22.6972 13.6813 21.1267 1.3323 8.6822 10.6755 11.4954 13.4413 27.7942 10.4444 3.9426 15.4874 7.2132 5.9176 4.2329 5.7786 8.8012 7.7282
temp: 298.150 k
press: 1.00000 atm
elementType: 7 7 6 6 6 6 6 6 6 6 6 6 6 6 6 1 1 1 1 1 1 1 1 1 1 1 1 1 1 1 1 1 1 1 1 1
symmnumber: 1
zpe: 843721.2 jmol-1
zpe.correction: 0.321356 hartree
zpe.thermalcorrener: 0.335670 hartree
zpe.thermalcorrenthalpy: 0.336614 hartree
zpe.thermalcorrgfe: 0.278699 hartree
zpe.sumelectzpe: -616.090320 hartree
zpe.sumelectthermal: -616.076006 hartree
zpe.sumelectthermalent: -616.075062 hartree
zpe.sumelectthermalfe: -616.132977 hartree
dipole: -3.4444 2.1725 0.7832
dipole: 4.1469
quadrupole: -46.4726 -72.9774 -83.9727
quadrupole: -3.6034 4.0443 1.6410
quadrupole: 21.3349 -5.1698 -16.1651 -3.6034 4.0443 1.6410
hfenergy: -616.4116761 hartree
pointgroup: C01 [X(C13H21N2)]
dipole: -1.3337453 0.7616587 0.550354 debye
polarizability: 170.7269898|-13.6558944|132.8114101|10.1733741|16.6601569|121.0552222 unknown
InChI: InChI=1S/C13H21N2/c1-15(10-5-2-6-11-15)12-8-13-7-3-4-9-14-13/h3-4,7,9H,2,5-6,8,10-12H2,1H3
charge 1 multiplicity 1
36 atoms
N  -1.744397 0.830421 0.092582
N  1.53698 -0.293033 -0.842752
C  -2.736991 0.805422 -1.100516
C  -1.371241 -0.626267 0.465014
C  -0.490011 1.610073 -0.392996
C  -3.97752 -0.06216 -0.842044
C  -2.599472 -1.514353 0.723963
C  -3.581442 -1.508515 -0.468937
C  -2.370014 1.553552 1.276367
C  0.729128 1.60313 0.545891
C  1.781354 0.536323 0.215207
C  2.979775 0.464752 0.966942
C  3.958363 -0.48696 0.607783
C  2.491746 -1.209334 -1.185946
C  3.714479 -1.340059 -0.494152
H  -2.16222 0.402888 -1.953237
H  -2.998289 1.856248 -1.316321
H  -0.717508 -0.569662 1.351422
H  -0.762381 -0.994372 -0.378581
H  -0.848757 2.637148 -0.57714
H  -0.191706 1.139158 -1.345295
H  -4.576573 -0.054057 -1.771222
H  -4.622616 0.382652 -0.061171
H  -3.119317 -1.2163 1.654465
H  -2.220111 -2.537099 0.903746
H  -4.48191 -2.096669 -0.22213
H  -3.108515 -1.999511 -1.342184
H  -3.274598 1.025221 1.603181
H  -1.64952 1.58551 2.106513
H  -2.631404 2.578722 0.971109
H  1.2131 2.594882 0.454311
H  0.444269 1.532062 1.613654
H  3.147489 1.146726 1.807793
H  4.894102 -0.558202 1.170863
H  2.258423 -1.848472 -2.043996
H  4.449501 -2.085464 -0.810187
