program: Gaussian 09
title: 000201812
version: EM64L-G09RevD.01
frameworkgroup: C1[X(C16H23NO3)]
method: RPBEPBE
basis: SDD
operation: Freq
keyword: #p
keyword: freq=noraman
keyword: PBEPBE/SDD
title: #p freq=noraman PBEPBE/SDD
converged: NO YES NO NO
title: Mulliken charges:
elementType: O O O N C C C C C C C C C C C C C C C C H H H H H H H H H H H H H H H H H H H H H H H
charge: -0.275358 -0.436766 -0.431237 -0.169302 0.098886 -0.553753 0.289838 0.457637 -0.457038 -0.405133 0.138589 -0.488685 -0.047234 -0.472649 -0.630569 -0.415379 -0.203928 -0.481441 -0.343027 -0.515646 0.258009 0.225305 0.224367 0.219214 0.202164 0.224801 0.216099 0.242331 0.197439 0.252127 0.254432 0.212747 0.233778 0.214610 0.203706 0.219539 0.188189 0.250056 0.203368 0.237696 0.198999 0.329985 0.333235
chargesum: 0.00000
title: Mulliken charges with hydrogens summed into heavy atoms:
elementType: O O O N C C C C C C C C C C C C C C C C
charge: -0.275358 -0.106781 -0.098002 -0.169302 0.098886 -0.070439 0.289838 0.457637 -0.013457 0.021832 0.138589 -0.030256 0.150206 -0.220522 -0.163390 -0.181601 0.010682 -0.058196 0.095218 0.124416
polarizability: 2.20164180e+02 -2.53836561e+01 1.70154317e+02 9.83803792e+00 -3.70247586e+00 1.73845163e+02
1716.lowfreq: -16.2424 -5.3175 -0.0007 0.0004 0.0008 11.4581 32.7533 58.2431 67.7197
frequency: 32.6548 58.1508 67.6561 70.9194 80.8071 88.8053 109.7579 132.6748 145.4932 175.5491 193.4719 215.6803 224.8156 239.5799 244.2104 270.4748 288.9760 296.0705 326.0666 336.7687 356.8225 363.8435 399.1442 409.3614 422.2920 440.3202 468.1139 501.7853 539.6288 561.3606 597.3266 617.2990 642.2808 669.2831 712.9169 735.3249 743.3340 758.3655 805.9516 816.1737 835.0044 863.2241 874.6572 901.3678 906.9182 938.9784 953.4924 961.6358 971.2652 974.8774 989.1931 1003.3254 1020.1953 1030.0969 1034.3727 1043.2278 1059.7667 1088.2573 1095.2658 1108.6631 1110.3995 1139.1950 1143.8099 1145.7304 1155.6287 1157.2944 1165.4613 1182.0075 1205.8486 1212.4243 1219.4665 1235.6568 1276.4671 1279.6043 1282.4345 1285.9896 1295.3772 1309.7389 1321.1344 1326.5754 1332.8880 1337.4631 1349.2902 1357.9590 1364.3797 1369.8394 1387.2901 1431.5614 1457.0618 1458.9715 1462.7532 1463.1556 1468.4873 1475.3766 1476.6541 1477.9070 1491.5865 1598.2357 1637.8136 1652.7893 2842.5629 2892.7873 2928.4806 2938.9456 2963.0349 2979.9523 2986.4021 2995.1815 3001.4026 3004.5195 3005.6980 3013.0142 3047.3436 3062.9516 3080.0963 3087.2769 3099.8430 3101.8467 3108.3687 3137.9907 3167.4773 3533.3616 3557.9182
redmass: 4.9677 3.8398 3.8865 5.9627 2.7252 3.0516 2.1390 3.6963 2.8270 1.5183 3.4899 3.0043 2.7369 2.6562 2.8940 2.5901 2.5730 1.2745 2.6160 3.9577 1.3414 2.3288 2.6431 3.1313 3.3140 3.7588 3.3952 3.8840 3.8812 4.0526 4.0794 3.2364 3.9607 3.2945 2.7153 3.4706 1.8794 1.7318 1.5653 1.5328 2.4789 3.1601 2.5297 2.9379 3.6275 2.5574 3.8353 2.1790 1.4049 1.8346 1.8487 2.6563 3.6592 2.5297 2.7032 2.8572 2.7343 2.1993 1.9474 1.7770 1.4261 1.9059 1.2715 1.6892 1.4361 1.5793 1.5446 2.1581 1.6296 1.5644 1.6170 1.5707 1.3752 1.3271 1.5789 1.3753 1.2090 1.4156 1.6303 1.5263 1.6378 1.3040 1.5389 1.6489 1.1846 1.1844 1.7766 1.1278 1.0927 1.0636 1.0835 1.0836 1.0851 1.0504 1.0875 1.0887 1.0880 6.9754 7.4009 7.9306 1.0708 1.0813 1.0343 1.0701 1.0599 1.0699 1.0664 1.0862 1.0605 1.1013 1.0922 1.0593 1.1035 1.1032 1.1035 1.0870 1.0972 1.0950 1.0854 1.0974 1.0963 1.0662 1.0661
irintensity: 0.1541 0.6816 4.0740 2.6523 1.9452 2.8515 3.9061 2.3144 0.0620 0.0213 0.2922 0.5022 2.7517 13.0077 0.4992 2.0053 13.7112 39.2379 10.6015 1.8205 201.6664 17.9009 5.8104 8.3757 2.4823 11.7854 13.8879 1.9595 3.9631 3.1340 6.8358 7.8019 6.1780 11.2043 2.0561 10.9229 3.2116 6.5824 16.9460 46.5651 2.6650 7.6611 7.2985 26.2568 36.4759 36.6083 110.3253 2.9109 1.0244 7.5306 12.2389 6.3812 28.9784 91.0395 76.2559 37.1903 25.9456 9.9751 3.8947 4.6051 5.4004 14.8937 22.7479 20.7727 2.8340 7.8191 12.6215 10.4843 10.4803 0.5148 14.4096 4.6359 8.9249 1.0686 11.6156 15.8556 16.8546 15.3695 1.6211 3.3121 2.3554 14.3230 2.4458 5.7759 28.4369 23.4568 7.0022 2.6521 8.8610 10.2288 6.3335 10.8791 3.2611 15.8369 7.4816 3.4363 18.4689 2.2984 2.1318 1.9396 80.1446 52.1270 94.7956 70.0390 30.3551 23.1629 39.0178 53.9531 62.3672 63.1701 34.5483 23.9605 31.1271 34.4701 18.5260 8.6688 34.1469 14.9910 3.3702 29.7696 11.3581 3.1003 7.8240
temp: 298.150 k
press: 1.00000 atm
elementType: 8 8 8 7 6 6 6 6 6 6 6 6 6 6 6 6 6 6 6 6 1 1 1 1 1 1 1 1 1 1 1 1 1 1 1 1 1 1 1 1 1 1 1
symmnumber: 1
zpe: 950142.7 jmol-1
zpe.correction: 0.361890 hartree
zpe.thermalcorrener: 0.381990 hartree
zpe.thermalcorrenthalpy: 0.382934 hartree
zpe.thermalcorrgfe: 0.313953 hartree
zpe.sumelectzpe: -902.276944 hartree
zpe.sumelectthermal: -902.256845 hartree
zpe.sumelectthermalent: -902.255900 hartree
zpe.sumelectthermalfe: -902.324881 hartree
dipole: -0.7588 0.9518 -0.9108
dipole: 1.5202
quadrupole: -127.1286 -123.8160 -113.6537
quadrupole: -11.0925 5.6911 -7.8510
quadrupole: -5.5958 -2.2833 7.8791 -11.0925 5.6911 -7.8510
hfenergy: -902.6388346 hartree
pointgroup: C01 [X(C16H23N1O3)]
dipole: -0.2934521 0.3906073 -0.3450222 debye
polarizability: 220.8946447|-24.0089051|168.9664359|10.6630252|-5.0400477|174.3025793 unknown
InChI: InChI=1S/C16H23NO3/c1-20-14-3-2-13-5-8-17-7-4-12(11-19)15(6-9-18)16(13,17)10-14/h2-3,5,14,18-19H,4,6-11H2,1H3
charge 0 multiplicity 1
43 atoms
O  -3.674795 -0.552326 -1.378834
O  4.228101 1.07819 -0.539626
O  0.492139 3.853332 1.165783
N  0.556413 -2.062438 0.386456
C  -0.175521 -0.781643 0.120072
C  -1.383567 -1.019412 -0.834691
C  0.791082 0.331869 -0.403475
C  -0.691974 -0.468733 1.53695
C  1.456824 -2.487453 -0.697326
C  1.119753 -1.969954 1.765521
C  2.016772 -0.002289 -0.930873
C  2.53608 -1.432407 -1.038638
C  -2.477316 0.068049 -0.75695
C  0.092166 -1.095302 2.462353
C  0.352728 1.792643 -0.255905
C  -1.93916 0.262623 1.719144
C  -2.775506 0.514472 0.665227
C  3.021605 1.03289 -1.409612
C  1.019483 2.49871 0.953978
C  -4.672465 0.419239 -1.825885
H  -1.851095 -1.970651 -0.522058
H  -1.054602 -1.128018 -1.883234
H  0.832882 -2.68166 -1.590365
H  1.922293 -3.450739 -0.417814
H  2.139332 -1.507063 1.811808
H  1.197714 -2.977347 2.219372
H  2.918457 -1.605709 -2.065715
H  3.422325 -1.529529 -0.379291
H  -2.201926 0.952915 -1.379187
H  -0.032313 -1.057059 3.548253
H  -0.733028 1.867707 -0.093475
H  0.576767 2.372941 -1.173584
H  -2.225914 0.562546 2.735274
H  -3.722297 1.043692 0.831866
H  2.582715 2.043771 -1.500283
H  3.438024 0.744731 -2.390815
H  2.124485 2.527428 0.830498
H  0.785608 1.96123 1.886173
H  -5.151924 0.955343 -0.980666
H  -5.440434 -0.161105 -2.3615
H  -4.226613 1.167564 -2.51635
H  3.926836 1.254053 0.389569
H  0.677765 4.401299 0.361457
