program: Gaussian 09
title: 000201803
version: EM64L-G09RevD.01
frameworkgroup: C1[X(C19H20N2O4)]
method: RPBEPBE
basis: SDD
operation: Freq
keyword: #p
keyword: freq=noraman
keyword: PBEPBE/SDD
title: #p freq=noraman PBEPBE/SDD
converged: YES YES NO NO
title: Mulliken charges:
elementType: O O O O N N C C C C C C C C C C C C C C C C C C C H H H H H H H H H H H H H H H H H H H H
charge: -0.284552 -0.270032 -0.265407 -0.428904 -0.096695 -0.141157 -0.356620 -0.348907 -0.404366 -0.401863 -0.493166 0.509852 0.133622 -0.487487 -0.456921 0.262352 0.205234 0.158095 -0.325933 -0.349918 -0.305170 -0.202312 -0.385294 -0.366325 0.294635 0.233490 0.211906 0.184342 0.214723 0.256292 0.225500 0.215037 0.244703 0.219586 0.200254 0.286346 0.237383 0.249772 0.266675 0.254292 0.236301 0.235787 0.223221 0.254630 0.356998
chargesum: 0.00000
title: Mulliken charges with hydrogens summed into heavy atoms:
elementType: O O O O N N C C C C C C C C C C C C C C C C C C C
charge: -0.284552 -0.270032 -0.265407 -0.071905 -0.096695 -0.141157 0.088776 0.050159 0.077426 0.057877 -0.073326 0.509852 0.133622 -0.201141 -0.219538 0.262352 0.205234 0.158095 -0.076161 -0.083243 -0.050878 0.269777 -0.162073 -0.111696 0.294635
polarizability: 3.49608434e+02 1.78171251e+01 2.03814172e+02 3.23623559e+01 -1.12299294e+01 1.58448621e+02
1716.lowfreq: -59.7685 -4.3853 -0.0002 0.0002 0.0006 0.9473 9.2445 15.7325 24.1045
frequency: -59.7612 15.3469 23.6947 24.9112 42.1983 50.3880 78.6155 86.7714 129.7914 143.1362 156.7079 190.3284 221.5311 248.6325 255.9945 284.9207 295.6343 316.2092 330.8776 340.8130 375.4130 377.3971 391.5488 413.6277 415.8450 421.1810 440.0417 468.1096 484.2463 520.7408 544.8096 570.9456 580.1041 606.6139 616.5849 628.5717 665.2720 678.6907 690.4605 715.7194 748.8211 753.1839 766.5948 778.2066 801.5308 812.4591 817.4438 836.6456 841.6857 844.5410 876.4712 890.4673 914.1923 930.0675 944.5140 951.9608 967.5244 978.4941 993.7077 1002.5094 1006.9659 1026.2891 1051.1981 1056.6208 1065.1079 1081.7582 1103.2355 1115.7108 1119.3734 1137.7207 1140.2802 1145.0566 1157.5436 1170.6020 1177.7579 1184.4892 1200.1713 1236.8510 1248.0766 1250.5541 1256.2467 1263.6372 1289.5896 1294.1390 1309.8121 1330.0659 1340.0982 1358.0184 1363.1297 1365.6318 1379.4151 1387.7679 1409.2817 1411.4317 1422.6443 1440.6552 1445.3003 1455.0674 1458.9990 1464.8783 1474.4734 1478.5977 1487.0177 1502.2699 1546.3794 1592.0348 1610.7168 1623.5110 1630.9738 2845.9075 2857.6382 2874.2153 2981.7467 2983.5757 2992.5071 3009.7772 3026.7829 3052.5499 3086.3336 3099.0829 3101.2213 3118.5822 3133.5817 3140.2853 3162.6737 3172.3714 3173.7413 3180.3961 3580.8380
redmass: 2.3293 5.7608 5.8508 5.5132 6.2352 5.7023 4.5689 4.2591 5.6986 6.6861 4.3149 3.7771 5.7720 3.8707 4.9362 2.5415 5.8631 3.8633 3.2748 2.8690 1.2607 3.6073 3.1840 2.7838 2.8862 2.9959 3.5345 2.9256 4.1584 4.4869 3.9877 6.1920 4.3195 5.5486 2.4126 6.8994 3.6246 9.5216 5.4483 4.8096 4.4442 5.2334 3.6668 4.6440 4.9407 1.4681 1.3505 1.6464 7.7744 1.6595 3.8288 1.4868 2.9568 1.3856 2.2212 1.3830 1.3404 4.9709 2.5098 2.9325 2.0722 2.4581 1.7372 3.5090 1.4590 2.3516 1.4301 1.9330 1.0371 2.1799 2.4907 1.3690 2.2607 1.7251 1.1378 2.0757 1.1137 1.5489 2.1579 3.9329 1.8491 1.6080 1.4501 1.4870 1.3458 1.3933 1.2410 1.4597 1.3705 1.2837 1.7965 4.6148 2.6605 2.2029 3.5245 4.6034 1.1258 1.1144 1.1353 1.2262 1.3734 1.4734 1.2335 2.8451 8.2035 6.6278 7.9834 6.3764 8.2879 1.0704 1.0708 1.0698 1.0684 1.0862 1.0660 1.0533 1.0889 1.0896 1.1190 1.0966 1.0950 1.0898 1.0899 1.0890 1.0946 1.0960 1.0927 1.0954 1.0660
irintensity: 14.8202 0.0277 0.3436 0.2624 0.3425 1.0937 5.0156 2.0442 0.5049 0.0705 3.1526 5.0913 0.2036 0.1808 0.9787 0.4249 1.4015 6.0549 15.2625 5.6046 116.8308 28.6184 12.1567 1.6737 1.4079 8.9548 4.3628 0.1721 11.4388 9.1579 24.8990 17.8282 6.5738 1.6551 3.3315 1.3526 4.9874 0.8852 17.8997 1.1222 18.1267 3.9639 9.9886 16.9269 21.3427 44.4074 13.0451 26.8253 22.0872 38.3099 3.7152 23.2055 5.4426 2.3638 4.1088 1.5899 1.5591 180.0820 92.4526 12.4681 18.4062 24.1345 1.3996 18.9471 4.3791 2.3567 78.5808 55.7844 0.0752 14.0478 14.6872 285.1297 9.2969 19.8679 30.4523 7.2146 6.8527 1.6366 80.6307 233.6228 70.8839 71.2299 61.5453 54.3793 5.3109 43.8247 0.2250 4.4857 6.8637 0.6132 22.0820 34.5401 64.9169 155.9527 14.7389 51.7854 33.2205 13.7951 8.3953 54.7939 57.4120 35.2825 17.2174 21.9791 211.5178 44.6545 4.4966 112.9964 0.1889 45.0320 83.9155 101.1702 33.7989 16.6354 47.0003 133.0191 47.0517 32.5971 34.4964 5.3076 13.6634 19.9425 10.2300 8.6664 4.5549 4.9440 1.8185 6.3252 54.3297
temp: 298.150 k
press: 1.00000 atm
elementType: 8 8 8 8 7 7 6 6 6 6 6 6 6 6 6 6 6 6 6 6 6 6 6 6 6 1 1 1 1 1 1 1 1 1 1 1 1 1 1 1 1 1 1 1 1
symmnumber: 1
zpe: 938676.2 jmol-1
zpe.correction: 0.357523 hartree
zpe.thermalcorrener: 0.378531 hartree
zpe.thermalcorrenthalpy: 0.379475 hartree
zpe.thermalcorrgfe: 0.304966 hartree
zpe.sumelectzpe: -1144.566695 hartree
zpe.sumelectthermal: -1144.545687 hartree
zpe.sumelectthermalent: -1144.544743 hartree
zpe.sumelectthermalfe: -1144.619252 hartree
dipole: 0.0365 -0.8419 -3.0440
dipole: 3.1585
quadrupole: -125.8157 -137.6769 -156.1365
quadrupole: 15.0053 10.3334 3.9767
quadrupole: 14.0607 2.1995 -16.2601 15.0053 10.3334 3.9767
hfenergy: -1144.9242178 hartree
pointgroup: C01 [X(C19H20N2O4)]
dipole: -0.0334056 1.0473757 -0.6678543 debye
polarizability: 348.0353834|38.9493772|174.0992721|-11.1440096|23.7946302|189.7365717 unknown
InChI: InChI=1S/C19H20N2O4/c22-16-4-2-15(3-5-16)19(23)21-9-7-20(8-10-21)12-14-1-6-17-18(11-14)25-13-24-17/h1-6,11,22H,7-10,12-13H2
charge 0 multiplicity 1
45 atoms
O  2.771663 -1.062983 2.229665
O  -5.488339 -1.627279 -1.378079
O  -7.127642 -0.6397 0.078293
O  8.009432 0.566408 -1.106965
N  -0.840478 0.746461 -0.244094
N  1.670806 -0.599003 0.227402
C  -0.628641 -0.034211 1.002409
C  0.432989 1.340471 -0.710619
C  0.403701 -1.149682 0.761228
C  1.485352 0.240459 -0.976232
C  -1.925059 1.749854 -0.121119
C  -3.309609 1.120912 0.002423
C  2.820017 -0.65627 1.020449
C  -3.638799 -0.013643 -0.797822
C  -4.278382 1.689809 0.863635
C  4.141786 -0.2750 0.406765
C  -4.934943 -0.514963 -0.691684
C  -5.898764 0.063329 0.162699
C  -5.60074 1.170735 0.957818
C  5.095621 0.365379 1.237551
C  4.52623 -0.646217 -0.910454
C  -6.896479 -1.72759 -0.910456
C  6.384579 0.670187 0.760105
C  5.817196 -0.3651 -1.395313
C  6.742707 0.305226 -0.562034
H  -1.590407 -0.483397 1.306552
H  -0.275428 0.621243 1.837706
H  0.853006 2.064867 0.034705
H  0.248018 1.891738 -1.651976
H  0.634883 -1.671074 1.70348
H  -0.004543 -1.869277 0.024933
H  1.135998 -0.392811 -1.816284
H  2.439924 0.709579 -1.257284
H  -1.888431 2.375316 -1.03654
H  -1.760977 2.442513 0.743184
H  -2.883782 -0.463767 -1.447414
H  -4.006284 2.555039 1.479011
H  -6.346134 1.611467 1.624415
H  4.815019 0.601113 2.268955
H  3.825065 -1.193484 -1.550178
H  -7.04182 -2.701942 -0.412447
H  -7.572404 -1.580581 -1.770848
H  7.108668 1.175027 1.412815
H  6.128314 -0.663263 -2.400577
H  8.595109 1.012399 -0.445777
