program: Gaussian 09
title: 000201776
version: EM64L-G09RevD.01
frameworkgroup: C1[X(C14H19NO4)]
method: RPBEPBE
basis: SDD
operation: Freq
keyword: #p
keyword: freq=noraman
keyword: PBEPBE/SDD
title: #p freq=noraman PBEPBE/SDD
converged: YES YES NO NO
title: Mulliken charges:
elementType: O O O O N C C C C C C C C C C C C C C H H H H H H H H H H H H H H H H H H H
charge: -0.265529 -0.277391 -0.242507 -0.221331 -0.125199 -0.377316 -0.347329 0.250372 -0.403415 -0.644254 -0.657973 0.149987 0.180418 0.203400 -0.299714 -0.358466 -0.252060 -0.219702 -0.537466 0.227232 0.235015 0.202204 0.258902 0.246322 0.255075 0.222934 0.221467 0.220961 0.216451 0.203654 0.256825 0.286727 0.240965 0.231989 0.225528 0.250710 0.223573 0.218941
chargesum: 0.00000
title: Mulliken charges with hydrogens summed into heavy atoms:
elementType: O O O O N C C C C C C C C C C C C C C
charge: -0.265529 -0.277391 -0.242507 -0.221331 -0.125199 0.084930 0.113777 0.250372 0.097982 0.021108 0.018957 0.149987 0.180418 0.203400 -0.012987 -0.117501 -0.020071 0.005826 0.155758
polarizability: 2.35310757e+02 -1.05801996e+01 1.74885736e+02 -8.13519516e+00 -9.60402012e+00 1.21000148e+02
1716.lowfreq: -5.9421 0.0004 0.0007 0.0009 4.1165 7.3182 19.8480 27.9515 32.4192
frequency: 17.5109 27.7859 32.2595 46.3738 64.4446 80.5815 83.7997 95.3162 107.9746 134.4930 154.4446 175.4828 204.4507 214.3890 235.3162 257.1499 266.6374 299.0757 312.9925 321.5872 355.7597 372.2028 402.5770 436.4573 441.1016 493.5173 514.7119 547.4225 561.6370 572.4914 594.1215 646.2898 682.2060 733.7427 749.3691 760.9786 768.6924 779.1482 783.2078 792.5349 856.7968 887.9208 940.9194 950.0490 958.9257 982.7704 986.6199 1002.0726 1015.8562 1041.5420 1045.7345 1071.9388 1080.8213 1098.0392 1109.5174 1124.0719 1142.4004 1152.9721 1177.0041 1213.6692 1218.4969 1237.3715 1242.4098 1260.0517 1283.2037 1299.8818 1325.2467 1344.2414 1359.7258 1383.5877 1386.4019 1391.6842 1413.1702 1422.0864 1431.6809 1441.1855 1456.6375 1467.3117 1468.0718 1468.8881 1470.3136 1478.5164 1482.9740 1486.2468 1494.4857 1588.0479 1598.6101 1602.9472 1649.1994 2960.9383 2984.5054 2985.5711 2995.1354 2999.4972 3006.0718 3050.4862 3057.3289 3067.8376 3084.4342 3084.7379 3087.8368 3092.2361 3103.3075 3129.9554 3132.3615 3154.8362 3167.8063 3178.7481
redmass: 3.9798 4.8407 4.7215 7.2027 2.8603 2.9651 5.5180 3.6574 3.9090 3.3137 4.4957 2.3686 1.7971 1.0743 1.4183 1.7147 2.6664 3.5208 4.0119 2.8221 4.5111 6.0987 2.7322 3.7260 4.1477 3.3407 3.9757 4.4364 4.5668 3.6217 3.6862 6.2249 4.8976 5.8396 3.4879 1.6609 2.4686 1.1601 2.3177 2.0892 1.4926 2.6606 2.1515 2.4673 1.9701 3.3202 1.7976 2.3073 3.2185 5.4006 2.2066 2.0636 1.8383 1.7606 1.2587 1.7297 2.1293 1.3989 1.0864 3.0074 3.3864 3.0256 1.2157 1.3900 1.4457 1.3338 1.3409 1.2489 1.2860 9.9717 1.2184 1.2087 2.0036 1.6187 1.2351 1.4810 1.1119 1.1611 1.0443 1.0754 1.0431 1.0598 1.0576 1.9186 1.1058 7.2132 6.9321 6.6055 10.6950 1.0330 1.0360 1.0356 1.0609 1.0639 1.0631 1.1039 1.0988 1.0995 1.0993 1.0990 1.1001 1.1013 1.1018 1.0984 1.0874 1.0907 1.0943 1.0988
irintensity: 0.3130 2.9675 3.2300 3.0810 2.0731 0.9101 0.5544 7.8285 1.0250 0.6996 2.0056 0.2060 0.3107 0.3895 1.7317 0.9505 1.8883 8.4930 8.1851 2.8553 11.7420 3.2332 1.0448 12.9680 8.1442 2.1823 9.1470 4.3815 9.8277 4.3432 3.9289 8.8680 18.8653 12.6476 5.5762 88.2768 10.5964 2.3561 7.2254 20.6511 0.3752 15.6613 17.1023 43.2634 21.5366 30.0854 7.9244 13.5419 57.3991 324.6251 16.5839 13.9289 9.4827 16.7506 0.1441 39.8557 29.6965 11.3659 4.3027 48.9585 134.3703 253.3857 23.1435 22.8952 22.6174 12.2711 19.5952 8.6219 7.9504 5.2535 15.3666 25.5447 64.6159 25.5436 100.2916 2.2431 16.7976 72.4042 5.9585 28.3224 15.8266 6.9694 11.2490 36.5071 11.4676 76.9178 111.8455 181.4984 214.3462 72.4257 25.8209 24.0581 50.9559 34.4047 37.5461 45.7018 5.1384 9.4513 16.0507 64.9044 8.9151 42.2674 30.6813 21.1440 3.4674 15.4225 12.4897 13.7411
temp: 298.150 k
press: 1.00000 atm
elementType: 8 8 8 8 7 6 6 6 6 6 6 6 6 6 6 6 6 6 6 1 1 1 1 1 1 1 1 1 1 1 1 1 1 1 1 1 1 1
symmnumber: 1
zpe: 810088.3 jmol-1
zpe.correction: 0.308546 hartree
zpe.thermalcorrener: 0.328820 hartree
zpe.thermalcorrenthalpy: 0.329764 hartree
zpe.thermalcorrgfe: 0.257030 hartree
zpe.sumelectzpe: -899.080545 hartree
zpe.sumelectthermal: -899.060271 hartree
zpe.sumelectthermalent: -899.059327 hartree
zpe.sumelectthermalfe: -899.132062 hartree
dipole: 1.3941 -1.3673 -1.4936
dipole: 2.4584
quadrupole: -64.1537 -109.0769 -116.1597
quadrupole: -2.4334 -4.3309 0.6846
quadrupole: 32.3097 -12.6134 -19.6962 -2.4334 -4.3309 0.6846
hfenergy: -899.3890918 hartree
pointgroup: C01 [X(C14H19N1O4)]
dipole: 0.4994822 0.7067869 0.431834 debye
polarizability: 233.3777812|16.469987|166.4889725|10.2374779|-21.8459204|131.3298876 unknown
InChI: InChI=1S/C14H19NO4/c1-4-15(5-2)13(16)10-19-14(17)11-8-6-7-9-12(11)18-3/h6-9H,4-5,10H2,1-3H3
charge 0 multiplicity 1
38 atoms
O  0.084126 0.705698 1.027568
O  1.824685 -1.168482 0.145065
O  -3.426283 1.424418 -0.901954
O  -0.543251 1.267992 -1.154142
N  3.684724 0.230032 0.234661
C  4.308454 1.555118 0.449649
C  4.574532 -0.894383 -0.150672
C  2.32595 -0.020823 0.350437
C  1.43522 1.185118 0.739883
C  4.861285 1.745518 1.880726
C  4.74364 -1.01291 -1.680128
C  -2.0060 -0.125976 0.260114
C  -0.80507 0.684264 -0.080667
C  -3.311322 0.219781 -0.208361
C  -1.833422 -1.31166 1.017071
C  -4.409608 -0.629626 0.079858
C  -2.925592 -2.158103 1.299429
C  -4.210564 -1.811745 0.826255
C  -4.748937 1.809537 -1.401013
H  5.130322 1.662872 -0.283593
H  3.581458 2.351509 0.21391
H  5.553289 -0.740608 0.3419
H  4.128453 -1.822184 0.245465
H  1.782729 1.671925 1.665359
H  1.398656 1.919797 -0.088096
H  4.053667 1.693087 2.632407
H  5.601846 0.963368 2.125609
H  5.357831 2.728784 1.974714
H  5.429373 -1.844301 -1.926622
H  5.159726 -0.086095 -2.116669
H  3.768465 -1.216096 -2.15363
H  -0.82155 -1.561209 1.349151
H  -5.4148 -0.375479 -0.268016
H  -2.774119 -3.077994 1.872541
H  -5.067697 -2.461552 1.036764
H  -4.586697 2.768379 -1.913873
H  -5.140609 1.063485 -2.119018
H  -5.470207 1.944845 -0.571381
