program: Gaussian 09
title: 000201778
version: EM64L-G09RevD.01
frameworkgroup: C1[X(C15H24N2O2)]
method: RPBEPBE
basis: SDD
operation: Freq
keyword: #p
keyword: freq=noraman
keyword: PBEPBE/SDD
title: #p freq=noraman PBEPBE/SDD
converged: NO YES NO NO
title: Mulliken charges:
elementType: O O N N C C C C C C C C C C C C C C C H H H H H H H H H H H H H H H H H H H H H H H H
charge: -0.458239 -0.316705 -0.109713 -0.153399 -0.071462 -0.074053 0.030030 -0.553590 -0.039175 -0.438749 -0.497732 -0.575944 -0.456734 -0.370847 -0.102837 -0.416700 -0.423270 0.216986 -0.494999 0.202776 0.199194 0.194417 0.229112 0.215989 0.215388 0.179911 0.208738 0.208200 0.272733 0.279788 0.199824 0.213914 0.215471 0.197686 0.208020 0.214358 0.209194 0.212466 0.209805 0.215066 0.246115 0.227537 0.331429
chargesum: 0.00000
title: Mulliken charges with hydrogens summed into heavy atoms:
elementType: O O N N C C C C C C C C C C C C C C C
charge: -0.126809 -0.316705 -0.109713 -0.153399 0.131314 0.125142 0.224447 -0.108489 0.176214 -0.050100 -0.016799 -0.096333 -0.027348 0.034859 0.111521 0.004960 0.001601 0.216986 -0.021347
polarizability: 1.77130316e+02 -1.33458949e+00 1.69466768e+02 -9.08265130e+00 -1.43351043e+00 1.54079208e+02
1716.lowfreq: -26.7428 -18.1502 0.0004 0.0007 0.0007 9.4319 37.7085 46.9562 73.9956
frequency: 37.6558 46.7232 73.9323 96.9255 117.8958 173.7067 209.0396 248.0099 279.5822 289.5702 294.8982 313.5994 333.3238 335.3677 361.9674 369.2639 393.5914 403.0647 438.7011 451.2562 459.6869 484.7387 496.7166 526.3171 530.3883 562.6364 618.6389 665.7516 683.6575 703.3146 725.2717 795.7675 800.8158 833.0974 840.5738 865.4030 885.5847 894.5293 900.8625 917.6273 927.8081 932.9335 942.7924 977.7587 988.1930 1011.0549 1023.4948 1033.7795 1048.4925 1058.6281 1074.8331 1087.6006 1091.8671 1097.7968 1106.5622 1111.3752 1119.0815 1135.2541 1155.4217 1159.4224 1168.4565 1176.7625 1189.3574 1224.1944 1226.5629 1233.3050 1245.8658 1251.8479 1263.1374 1267.2031 1283.5883 1296.2393 1303.3471 1311.8221 1315.0039 1319.3643 1328.3956 1332.3777 1340.7890 1344.0727 1348.5722 1350.4877 1357.7585 1360.5714 1364.0273 1377.1740 1381.0147 1402.0414 1426.5762 1442.6857 1451.0929 1460.8722 1463.2285 1466.8416 1475.0655 1476.0408 1485.0016 1487.9353 1570.3546 2798.0078 2809.9235 2876.7656 2893.4356 2945.5505 2951.9346 2966.4601 2969.8872 2985.8107 2987.6761 2989.5138 2990.7558 2994.4248 3003.5227 3005.1185 3020.3144 3030.4972 3038.3552 3044.3731 3052.8062 3071.1653 3071.4024 3087.2734 3556.4579
redmass: 4.3491 4.2410 3.6653 3.3507 4.3695 4.6511 3.4789 2.3772 2.6004 1.6985 1.7347 2.4438 2.9013 2.5236 2.8609 2.6742 2.8469 2.3827 3.8094 3.3798 3.1329 3.0280 3.0964 2.6662 2.5399 3.5125 3.3131 3.9462 3.0730 4.2188 3.3340 2.6709 2.6138 2.5625 2.1424 1.8177 2.5697 1.9714 2.6431 2.2734 1.8381 2.2341 2.6048 2.2260 2.0868 2.0644 1.7933 2.1634 1.9882 1.8066 1.5209 1.5888 1.9622 2.5946 1.9797 1.6854 1.8853 2.0313 1.8091 1.4656 1.5559 1.4260 1.4074 1.2572 1.1966 1.5115 1.5322 1.5850 1.3424 1.2667 1.6744 1.5601 1.4766 1.5707 1.3842 1.5648 1.3579 1.6260 1.4847 1.3796 1.5459 1.3797 1.4607 1.4721 1.4209 1.4604 1.6200 1.4878 1.9653 1.0889 1.2564 1.0928 1.1009 1.0919 1.0926 1.1013 1.0980 1.0917 7.5936 1.0769 1.0748 1.0696 1.0827 1.0710 1.0783 1.0632 1.0691 1.0632 1.0772 1.0684 1.0646 1.0832 1.0750 1.0801 1.0802 1.1021 1.0989 1.0991 1.1022 1.1020 1.0977 1.0901 1.0660
irintensity: 2.0077 0.6029 4.7576 6.2070 1.2274 0.3118 0.9790 1.1077 20.0615 66.5604 78.2586 8.9425 1.6206 7.5782 5.5115 3.6017 3.7724 4.1639 2.4190 4.5859 2.7022 9.1157 3.9731 0.7039 2.8757 1.9443 5.8932 1.7510 4.8667 2.8350 3.2938 5.2884 3.3525 1.4132 12.5832 0.2996 2.7062 3.1318 7.9051 27.7922 14.2139 0.7735 5.2045 15.7976 3.7103 1.6195 26.1071 5.2158 1.0798 28.6396 12.3202 2.1022 2.7412 23.1412 16.2192 9.9742 11.8811 22.8255 16.1667 6.7621 7.7953 6.6928 37.2212 14.0892 15.8644 3.6846 10.2410 19.5112 33.8285 11.1780 20.1566 20.7694 22.0965 10.9119 4.8072 13.5450 2.6995 6.1579 4.5457 8.1254 2.7315 6.6990 2.5837 2.3892 5.7558 10.4044 9.9229 1.6898 86.9617 12.3632 3.1657 33.1388 0.6477 12.0058 9.6285 9.1647 27.0974 6.2143 244.5138 35.5391 147.0688 105.3869 47.4022 52.7902 39.5399 23.0474 66.1906 51.6122 18.1592 39.2635 17.3809 110.2279 3.3560 76.1050 55.3195 45.0788 13.3599 46.8654 52.4543 47.6991 6.8139 7.4560 2.5596
temp: 298.150 k
press: 1.00000 atm
elementType: 8 8 7 7 6 6 6 6 6 6 6 6 6 6 6 6 6 6 6 1 1 1 1 1 1 1 1 1 1 1 1 1 1 1 1 1 1 1 1 1 1 1 1
symmnumber: 1
zpe: 988438.8 jmol-1
zpe.correction: 0.376476 hartree
zpe.thermalcorrener: 0.392690 hartree
zpe.thermalcorrenthalpy: 0.393634 hartree
zpe.thermalcorrgfe: 0.333570 hartree
zpe.sumelectzpe: -844.466958 hartree
zpe.sumelectthermal: -844.450745 hartree
zpe.sumelectthermalent: -844.449800 hartree
zpe.sumelectthermalfe: -844.509864 hartree
dipole: -1.5680 3.5735 0.6033
dipole: 3.9487
quadrupole: -111.0827 -119.2609 -112.1956
quadrupole: -3.4007 -10.9251 -7.7112
quadrupole: 3.0971 -5.0811 1.9841 -3.4007 -10.9251 -7.7112
hfenergy: -844.8434344 hartree
pointgroup: C01 [X(C15H24N2O2)]
dipole: 0.4877874 -1.4696102 -0.1257336 debye
polarizability: 175.7711218|-4.6285577|168.4252177|9.5014298|4.1999843|156.479953 unknown
InChI: InChI=1S/C15H24N2O2/c18-12-4-5-16-8-10-6-11(14(16)7-12)9-17-13(10)2-1-3-15(17)19/h10-14,18H,1-9H2
charge 0 multiplicity 1
43 atoms
O  -4.376911 0.510088 0.030911
O  1.186117 2.490608 -0.648077
N  -0.982942 -0.487791 0.72194
N  1.519742 0.185444 -0.701603
C  -0.504244 -0.89855 -1.727319
C  0.785814 -2.127641 0.004742
C  -1.548597 -0.456707 -0.660734
C  0.075879 -2.284217 -1.360441
C  1.974192 -1.112951 -0.126246
C  -0.295449 -1.757048 1.047489
C  0.682924 0.075825 -1.915939
C  -2.113455 0.952813 -0.947612
C  2.76025 -0.939342 1.190667
C  -2.019302 -0.167235 1.739137
C  -3.172329 1.376349 0.089273
C  -2.611945 1.23477 1.512513
C  3.626869 0.333712 1.161401
C  1.734391 1.444986 -0.161215
C  2.688778 1.54902 1.028265
H  -1.037649 -0.958256 -2.697864
H  1.234088 -3.094531 0.312251
H  -2.39992 -1.189035 -0.729358
H  -0.72504 -3.04555 -1.287935
H  0.785705 -2.62239 -2.141626
H  2.66599 -1.562269 -0.878094
H  -1.016759 -2.618615 1.095613
H  0.138566 -1.659236 2.061025
H  1.311227 -0.305518 -2.750261
H  0.358684 1.095307 -2.175318
H  -1.288999 1.690017 -0.915297
H  -2.547466 0.974127 -1.969206
H  3.373347 -1.846203 1.348851
H  2.062049 -0.863607 2.045181
H  -1.546181 -0.214274 2.738789
H  -2.846878 -0.919767 1.720444
H  -3.473688 2.429623 -0.09558
H  -3.419942 1.424705 2.242373
H  -1.823982 1.997392 1.654229
H  4.330916 0.300477 0.306368
H  4.235051 0.412689 2.081582
H  3.241094 2.496654 0.905368
H  2.074856 1.656155 1.944889
H  -4.740045 0.542176 -0.890375
