program: Gaussian 09
title: 000201762
version: EM64L-G09RevD.01
frameworkgroup: C1[X(C11H14N2O2)]
method: RPBEPBE
basis: SDD
operation: Freq
keyword: #p
keyword: freq=noraman
keyword: PBEPBE/SDD
title: #p freq=noraman PBEPBE/SDD
converged: YES YES NO NO
title: Mulliken charges:
elementType: O O N N C C C C C C C C C C C H H H H H H H H H H H H H H
charge: -0.202076 -0.242352 -0.148142 -0.488283 0.121301 0.319074 0.175243 -0.375986 -0.403456 -0.790147 -0.246444 0.299144 -0.220767 -0.611382 -0.641688 0.253101 0.236069 0.210883 0.270171 0.230862 0.335061 0.233260 0.231730 0.229092 0.221318 0.284707 0.240663 0.249287 0.229757
chargesum: 0.00000
title: Mulliken charges with hydrogens summed into heavy atoms:
elementType: O O N N C C C C C C C C C C C
charge: -0.202076 -0.242352 -0.148142 -0.153223 0.121301 0.319074 0.175243 -0.122885 -0.167388 -0.078231 -0.013183 0.299144 0.010963 0.123736 0.078019
polarizability: 1.90978408e+02 -3.85856342e+00 1.38424360e+02 5.32880979e+00 4.26027513e+00 9.61760004e+01
1716.lowfreq: -6.8438 -5.2027 0.0004 0.0007 0.0008 2.2433 28.0156 38.5313 63.0723
frequency: 27.7277 38.5191 63.0508 86.6613 105.6746 122.7641 129.7265 144.5846 157.1646 204.3973 222.7186 240.1909 260.0630 325.0915 363.1667 386.3270 397.9187 451.4937 464.5800 510.3298 554.2848 588.2621 597.6443 645.5964 689.5004 705.2190 738.4810 750.7779 784.8857 817.2740 878.9357 900.3067 954.8316 969.6860 992.9422 994.3554 1045.3755 1049.9557 1057.8943 1070.2314 1096.3492 1132.0392 1136.8612 1147.3765 1177.6346 1206.3974 1230.9962 1252.2929 1282.7571 1358.6582 1372.6526 1404.3825 1412.6976 1419.0663 1425.9864 1443.6820 1455.4910 1471.4437 1473.5605 1478.2787 1482.9923 1489.5234 1500.9830 1578.5644 1605.9822 1619.1579 1655.9971 2948.8169 2968.9967 2991.6833 3040.9500 3044.1380 3077.4144 3092.2746 3093.0032 3120.4874 3121.8608 3127.7630 3143.7023 3163.8541 3527.6748
redmass: 3.6627 4.5879 3.6094 4.5828 2.1525 1.3443 1.6231 1.1532 2.1200 4.1382 3.1301 3.6727 5.6591 4.2409 4.9617 2.9670 3.3004 3.2448 3.6224 4.3678 5.3243 1.6797 2.0488 6.1524 6.2424 7.1089 2.7322 2.1685 2.6644 4.7286 1.3394 6.1726 1.5355 2.7982 1.5898 1.3517 1.6456 2.1299 1.3778 2.7912 1.2307 1.7302 1.5608 1.8541 1.0633 2.8187 2.8302 5.5499 1.4604 3.1917 7.1603 1.2457 1.9175 1.1801 1.8713 1.1682 1.0812 1.2243 1.0665 1.8848 1.1431 1.0567 1.1354 6.5083 5.8923 5.7221 9.9824 1.0435 1.0365 1.0366 1.0939 1.0990 1.0965 1.1007 1.0994 1.0970 1.0859 1.0890 1.0937 1.1008 1.0768
irintensity: 2.2996 1.2273 0.6812 4.1974 2.5712 0.5202 0.1343 0.9537 1.0012 0.7239 9.4997 1.7339 4.5877 6.3772 8.6944 0.6181 1.3639 0.2628 12.3244 4.5814 0.9299 56.3407 38.7182 11.5105 3.2602 29.6100 13.8925 63.5902 13.1481 4.7345 0.6922 25.4249 13.6619 25.8743 0.4956 0.0517 12.8667 3.7167 9.7769 6.4680 2.3656 98.2004 75.6047 293.8910 0.8514 16.9557 115.9460 4.4323 8.1870 37.6930 3.7687 51.2540 644.2766 44.8996 42.8616 5.3554 19.2694 23.5270 21.2087 10.4793 13.0085 20.7891 28.2246 12.2913 1.0015 78.6480 405.7749 58.9841 85.8179 20.4735 59.6895 9.1999 14.0904 25.3610 15.4221 1.3314 7.4626 3.4393 29.1258 26.5437 8.1453
temp: 298.150 k
press: 1.00000 atm
elementType: 8 8 7 7 6 6 6 6 6 6 6 6 6 6 6 1 1 1 1 1 1 1 1 1 1 1 1 1 1
symmnumber: 1
zpe: 611668.7 jmol-1
zpe.correction: 0.232972 hartree
zpe.thermalcorrener: 0.248533 hartree
zpe.thermalcorrenthalpy: 0.249477 hartree
zpe.thermalcorrgfe: 0.188899 hartree
zpe.sumelectzpe: -686.425877 hartree
zpe.sumelectthermal: -686.410317 hartree
zpe.sumelectthermalent: -686.409373 hartree
zpe.sumelectthermalfe: -686.469951 hartree
dipole: 0.1506 -5.2943 4.4445
dipole: 6.9142
quadrupole: -70.3279 -89.8297 -92.2529
quadrupole: 7.1977 -7.8021 6.3054
quadrupole: 13.8090 -5.6929 -8.1161 7.1977 -7.8021 6.3054
hfenergy: -686.6588495 hartree
pointgroup: C01 [X(C11H14N2O2)]
dipole: 0.2786123 2.704218 -0.0963588 debye
polarizability: 191.1157733|1.7994974|117.4143121|-5.5094077|21.5384651|117.0486834 unknown
InChI: InChI=1S/C11H14N2O2/c1-8-6-4-5-7-9(8)10(14)12-11(15)13(2)3/h4-7,12H,1-3H3
charge 0 multiplicity 1
29 atoms
O  -0.367232 -1.823556 -0.889416
O  -2.878596 -1.30296 0.674324
N  -3.40139 0.891323 0.041344
N  -1.138885 0.184348 0.057755
C  1.274141 -0.186664 -0.113334
C  2.321498 -0.445741 -1.0534
C  -0.12124 -0.712714 -0.352013
C  1.554311 0.522249 1.086584
C  3.615829 0.051308 -0.755578
C  2.094296 -1.220214 -2.338478
C  2.853416 0.992718 1.368399
C  -2.51727 -0.166119 0.271611
C  3.888389 0.760574 0.435372
C  -4.808796 0.723364 0.438878
C  -3.039868 2.149912 -0.628715
H  0.758304 0.662543 1.827733
H  4.424852 -0.127861 -1.473356
H  2.980594 -1.155475 -2.992903
H  1.884314 -2.281963 -2.122418
H  1.215848 -0.849925 -2.896452
H  -0.845064 1.140098 0.271198
H  3.056802 1.52208 2.305334
H  4.903042 1.122365 0.635817
H  -5.471336 0.730002 -0.448043
H  -5.120666 1.536496 1.122012
H  -4.912329 -0.246321 0.948387
H  -3.89767 2.496734 -1.232362
H  -2.191271 1.997933 -1.316003
H  -2.786523 2.957965 0.089326
