program: Gaussian 09
title: 000201761
version: EM64L-G09RevD.01
frameworkgroup: C1[X(C14H19NO3)]
method: RPBEPBE
basis: SDD
operation: Freq
keyword: #p
keyword: freq=noraman
keyword: PBEPBE/SDD
title: #p freq=noraman PBEPBE/SDD
converged: YES YES NO NO
title: Mulliken charges:
elementType: O O O N C C C C C C C C C C C C C C H H H H H H H H H H H H H H H H H H H
charge: -0.253393 -0.283898 -0.264809 -0.114519 -0.348444 -0.397699 0.249544 -0.413353 -0.657836 -0.649680 0.118347 0.347216 0.174353 -0.343706 -0.392083 -0.800491 -0.241321 -0.219686 0.263963 0.208863 0.230402 0.224997 0.254316 0.252710 0.204476 0.245566 0.219496 0.217902 0.260311 0.214276 0.265043 0.232385 0.290454 0.237948 0.206623 0.233024 0.228702
chargesum: 0.00000
title: Mulliken charges with hydrogens summed into heavy atoms:
elementType: O O O N C C C C C C C C C C C C C C
charge: -0.253393 -0.283898 -0.264809 -0.114519 0.124383 0.057700 0.249544 0.093672 0.011702 0.042809 0.118347 0.347216 0.174353 -0.078663 -0.159698 -0.065466 -0.008297 0.009017
polarizability: 2.33531212e+02 8.43938699e+00 1.67373432e+02 1.42112162e+01 -8.15322792e+00 1.12715181e+02
1716.lowfreq: -19.4861 -11.8696 -6.4179 -0.0007 -0.0004 0.0004 4.1697 25.4420 33.4398
frequency: -18.4314 25.2444 33.2965 40.8813 60.5750 86.9351 97.3217 126.7269 133.0448 164.5104 204.4508 211.7121 217.7774 225.6296 255.2143 295.6589 309.4822 321.7554 347.2903 367.4204 407.4011 428.9728 433.3990 480.7929 505.8493 524.5128 546.9771 558.8420 605.9750 653.1878 682.7370 733.1493 743.7644 757.8598 780.8619 788.6939 796.3839 812.3713 882.4310 888.2106 938.7750 958.1894 968.4839 992.2408 996.6261 1002.1888 1021.3992 1042.4883 1051.9095 1062.0623 1072.3915 1082.7340 1098.4270 1116.7557 1145.9183 1175.6829 1208.8486 1212.6128 1235.9174 1242.2651 1258.1970 1286.6740 1296.2182 1330.9907 1339.9168 1357.0700 1373.4014 1386.2401 1397.3815 1411.2281 1413.4243 1429.5793 1433.9144 1456.9300 1465.4186 1468.1897 1470.0905 1476.0832 1480.2685 1483.0642 1487.3519 1501.3757 1572.9448 1596.1758 1602.0270 1614.7013 2983.3510 2983.5885 2984.0368 3002.9629 3007.5065 3033.3700 3053.1782 3067.9354 3068.9405 3084.3572 3085.3621 3086.7458 3091.0410 3100.2664 3106.3968 3123.6306 3138.5823 3150.9398 3167.6976
redmass: 3.1279 3.8026 3.7037 4.5626 6.0208 5.3494 4.1142 3.6517 3.5772 2.8661 1.3813 1.1026 2.0770 1.2949 1.9706 4.6004 3.3124 3.2824 4.1733 3.4963 3.0650 3.1845 3.5933 3.3791 3.5086 4.2507 4.8630 3.9336 3.4095 6.0971 4.9491 2.6489 2.9781 2.5926 1.2095 1.8427 1.5031 4.8070 1.3409 2.6822 2.1382 4.3824 1.4892 2.2488 1.3498 1.6872 2.7335 3.1114 1.6065 2.8499 2.0197 1.8781 1.7750 1.7251 2.0786 1.0640 2.8237 2.4547 2.7298 1.2195 1.4059 1.4968 1.3612 1.3108 1.2672 1.2921 7.5720 1.2196 1.2001 1.2376 2.0942 1.7217 1.3908 1.1099 1.1714 1.0447 1.0433 2.1177 1.0556 1.1149 1.0599 1.1035 6.5881 6.7311 8.5797 6.7955 1.0363 1.0361 1.0356 1.0630 1.0619 1.0576 1.1005 1.0992 1.0969 1.0996 1.0985 1.1012 1.1022 1.1021 1.1061 1.0860 1.0895 1.0941 1.1004
irintensity: 1.2885 1.1442 0.5652 4.8653 0.6097 2.6298 0.0873 0.7949 0.7168 1.5530 3.4290 0.2395 1.7985 0.2806 1.3480 0.6488 5.2686 5.1994 1.7650 29.9087 6.3864 1.7191 7.8142 5.2011 3.8321 2.6415 1.7314 7.1134 3.4697 4.6863 15.0379 22.9891 29.1515 22.0656 4.4828 28.2721 7.4063 2.0604 2.8713 18.7751 9.2335 3.2870 1.9043 3.9680 1.2254 3.6398 6.7951 177.4209 21.3579 86.8846 11.9460 7.9332 14.3302 38.3900 30.4916 1.6745 37.6651 0.7130 208.4823 14.0440 16.9312 55.0734 13.2085 12.6568 8.0926 8.4470 15.9145 17.7216 25.9236 21.2759 57.8407 12.4242 92.7165 20.8849 7.7875 8.1664 7.9733 9.2317 12.0559 43.6529 5.4846 10.4433 19.7147 355.9763 118.9586 46.3365 29.5232 33.6067 16.1125 37.6083 27.5362 32.1476 11.3968 9.3418 20.9759 43.0935 32.0191 14.0171 24.2726 30.8565 4.1598 3.8768 13.8282 19.3398 26.8749
temp: 298.150 k
press: 1.00000 atm
elementType: 8 8 8 7 6 6 6 6 6 6 6 6 6 6 6 6 6 6 1 1 1 1 1 1 1 1 1 1 1 1 1 1 1 1 1 1 1
symmnumber: 1
zpe: 800732.2 jmol-1
zpe.correction: 0.304983 hartree
zpe.thermalcorrener: 0.323065 hartree
zpe.thermalcorrenthalpy: 0.324009 hartree
zpe.thermalcorrgfe: 0.257606 hartree
zpe.sumelectzpe: -823.963042 hartree
zpe.sumelectthermal: -823.944960 hartree
zpe.sumelectthermalent: -823.944016 hartree
zpe.sumelectthermalfe: -824.010418 hartree
dipole: 2.7212 0.9383 1.5153
dipole: 3.2529
quadrupole: -78.9238 -108.1540 -106.9528
quadrupole: 4.9597 3.7541 -0.0219
quadrupole: 19.0864 -10.1438 -8.9426 4.9597 3.7541 -0.0219
hfenergy: -824.2680246 hartree
pointgroup: C01 [X(C14H19N1O3)]
dipole: 1.0815172 -0.151147 0.6673728 debye
polarizability: 234.0199146|-2.7954995|147.8811303|14.3084907|27.6191715|131.7187801 unknown
InChI: InChI=1S/C14H19NO3/c1-4-15(5-2)13(16)10-18-14(17)12-9-7-6-8-11(12)3/h6-9H,4-5,10H2,1-3H3
charge 0 multiplicity 1
37 atoms
O  -0.108546 -0.820472 0.779183
O  1.51788 -0.604419 -1.420562
O  -0.170965 1.492814 1.014044
N  3.337864 0.157277 -0.181804
C  4.073523 0.492049 -1.427814
C  3.966585 0.540001 1.106623
C  2.067961 -0.379365 -0.297063
C  1.339871 -0.742565 1.022506
C  5.030494 -0.635826 -1.866605
C  3.585975 1.969822 1.554427
C  -2.176179 0.319482 0.259324
C  -2.691336 -0.725921 -0.573885
C  -0.755629 0.424255 0.696335
C  -3.020366 1.381528 0.689652
C  -4.06724 -0.658733 -0.921143
C  -1.853408 -1.863397 -1.129335
C  -4.381837 1.413787 0.340131
C  -4.908383 0.380333 -0.469476
H  3.323636 0.674387 -2.215598
H  4.630623 1.431907 -1.253729
H  3.701284 -0.195027 1.887129
H  5.061946 0.461674 0.975765
H  1.622179 -1.758129 1.346994
H  1.534453 -0.013028 1.824631
H  5.779009 -0.862392 -1.084778
H  4.461143 -1.555803 -2.083137
H  5.573533 -0.341678 -2.783485
H  3.916218 2.714764 0.808387
H  2.492106 2.072479 1.667646
H  4.068627 2.213863 2.518701
H  -2.577429 2.177188 1.297834
H  -4.47988 -1.442172 -1.567518
H  -0.873634 -1.514557 -1.499446
H  -1.63372 -2.610843 -0.345461
H  -2.393778 -2.369102 -1.948663
H  -5.022167 2.231666 0.686695
H  -5.965813 0.389552 -0.757606
