program: Gaussian 09
title: 000201786
version: EM64L-G09RevD.01
frameworkgroup: C1[X(C21H29NO)]
method: RPBEPBE
basis: SDD
operation: Freq
keyword: #p
keyword: freq=noraman
keyword: PBEPBE/SDD
title: #p freq=noraman PBEPBE/SDD
converged: YES YES NO NO
title: Mulliken charges:
elementType: O N C C C C C C C C C C C C C C C C C C C C C H H H H H H H H H H H H H H H H H H H H H H H H H H H H H
charge: -0.282039 -0.092707 -0.237688 0.396519 -0.292899 -0.510835 0.141375 -0.384462 -0.232983 -0.426822 0.402024 -0.385822 -0.310197 -0.391877 -0.003728 -0.270372 -0.464699 -0.431857 -0.263750 -0.686051 -0.698972 -0.246957 -0.611473 0.237081 0.181994 0.211798 0.243681 0.194768 0.216984 0.203464 0.198173 0.182784 0.230961 0.215428 0.218861 0.204754 0.184653 0.231223 0.227680 0.225212 0.238778 0.236673 0.226949 0.225466 0.219498 0.215423 0.227953 0.211521 0.214814 0.228257 0.217934 0.213506
chargesum: 0.00000
title: Mulliken charges with hydrogens summed into heavy atoms:
elementType: O N C C C C C C C C C C C C C C C C C C C C C
charge: -0.282039 -0.092707 -0.000607 0.396519 0.100893 -0.072386 0.141375 0.035987 0.147974 -0.195860 0.402024 0.048467 0.079210 -0.160654 0.223951 -0.045160 -0.225921 -0.195184 -0.036801 -0.025664 -0.044683 -0.018700 -0.180033
polarizability: 2.86256654e+02 3.57735066e+01 1.99743804e+02 -1.08691558e+01 6.88524096e+00 2.43776870e+02
1716.lowfreq: -9.3429 -6.1077 -5.5037 0.0003 0.0005 0.0007 7.9435 15.4065 27.7097
frequency: -6.4216 14.3437 26.9587 29.2719 43.3786 54.8608 62.9704 67.8359 78.3679 103.6223 113.2827 120.4791 146.0112 162.4351 174.5988 178.6931 200.9811 205.0645 222.2199 256.0061 270.2835 287.9532 305.8570 340.3686 363.7522 399.4608 403.8454 415.6367 452.0815 473.1638 480.8344 498.3695 502.7400 523.2920 539.1461 574.1326 615.5314 636.2274 668.8966 710.0057 743.7642 745.2971 770.9555 785.1616 791.6677 798.8833 808.6057 813.7043 828.0574 878.3362 879.4552 894.5239 905.2921 915.5548 939.7529 944.8353 952.2457 961.1216 976.0053 982.1731 992.5368 998.9604 1009.1342 1029.2221 1032.5599 1050.1244 1060.4574 1065.8853 1069.0571 1082.8444 1085.8316 1090.6472 1099.0604 1117.1162 1128.8085 1152.2614 1157.9415 1174.0701 1185.3805 1191.5246 1203.9635 1220.5048 1231.7358 1236.8634 1242.1490 1259.9507 1271.7942 1286.1956 1286.7185 1296.5082 1303.8409 1319.8976 1321.4867 1331.3935 1340.0921 1359.3629 1368.0605 1377.1737 1382.2670 1385.8672 1400.3132 1404.7337 1413.8279 1424.7017 1441.4667 1455.1926 1456.3460 1464.6156 1466.3079 1466.8625 1472.7244 1477.0041 1480.8124 1484.3076 1489.3658 1497.4993 1518.8589 1587.2984 1597.4323 1631.2015 1657.2887 2859.2000 2910.2335 2914.7170 2932.5953 2960.2594 2971.0692 2977.8747 2983.3081 2986.9185 2990.9453 3015.2106 3039.7746 3045.7172 3047.4624 3059.2730 3072.5627 3076.2919 3079.1100 3081.2636 3089.0773 3092.5942 3117.2027 3120.0972 3127.2525 3133.3820 3151.7742 3153.2942 3166.3697 3191.4527
redmass: 4.8849 3.8466 3.3112 3.8596 3.8442 2.7921 3.0027 2.8274 2.4209 2.7678 2.4961 4.1286 2.4823 2.7961 2.2956 2.8939 2.7983 2.4252 1.1386 3.2708 1.9617 1.8676 3.0982 3.1069 4.1123 2.7805 2.7745 2.7979 2.3735 3.2072 3.2713 4.3129 3.0989 4.4247 3.2724 2.7332 3.9991 2.1195 2.6340 3.9620 1.8638 1.7825 1.1365 5.4242 1.7716 1.1564 1.1758 1.5750 3.4190 1.7581 1.9051 1.9866 1.9894 1.4661 2.5064 1.5406 2.3176 1.3786 2.5091 1.3664 1.3548 2.5158 1.2420 3.2804 2.3241 4.0545 2.3133 1.9848 1.8848 2.3032 2.4494 2.3402 2.5234 1.6966 1.8645 1.4123 1.3520 1.1097 1.2653 1.2958 2.0723 1.3961 1.7480 1.9041 1.6778 1.7073 1.1194 1.2142 1.2420 1.2673 1.3013 1.3427 1.3959 1.3437 1.2389 1.4091 1.3514 1.2453 1.9178 1.2492 1.5064 2.6920 4.1413 1.1858 2.4879 2.3767 1.0658 1.0962 1.0741 1.0647 1.0617 1.0580 1.0544 1.0682 1.0801 1.0759 3.6866 7.3951 5.2622 6.4043 4.6867 1.0715 1.0687 1.0556 1.0566 1.0656 1.1046 1.0351 1.0367 1.1026 1.0613 1.0867 1.0995 1.0846 1.0947 1.0922 1.0988 1.0989 1.0656 1.1008 1.1004 1.0883 1.0858 1.0864 1.0908 1.0888 1.0946 1.0988 1.0987 1.1144
irintensity: 0.1533 0.0046 0.0486 0.0438 0.0265 0.0468 0.1741 0.6014 0.2623 3.7900 0.1888 1.8329 0.3740 1.9295 0.9488 2.1193 1.5567 1.4745 0.3078 5.3496 0.4103 1.9558 0.6247 3.1840 3.7427 0.8390 2.7271 3.4993 7.2000 0.8675 8.2148 5.7380 5.6149 0.5332 3.8307 7.1117 7.0925 6.2423 2.1379 2.3906 5.7177 5.7666 6.2518 0.0682 90.1926 5.5736 1.0614 47.6351 1.0253 2.7450 5.7895 1.4619 29.2925 0.2672 25.9642 48.8528 6.1338 0.8293 8.9851 2.7148 0.6950 11.8674 9.6875 11.6188 8.2932 201.6828 91.5399 2.1065 32.8278 1.8008 30.9517 24.7635 12.9583 4.0258 3.9089 0.7798 9.2158 3.1429 0.5788 1.3445 28.1420 4.8952 19.9071 5.3585 0.5479 2.8925 0.7629 9.4161 12.5452 2.7523 25.6916 1.6637 6.7528 1.2656 7.8822 3.1193 10.0217 27.0219 13.3608 24.9442 3.4642 1.7564 3.2306 5.2371 5.3068 0.8583 9.6744 23.8530 20.2217 1.2148 3.2164 0.8381 8.1380 2.3833 19.0495 1.2037 9.2919 5.1927 5.2214 0.1657 16.9740 88.6162 51.5543 36.0188 88.5280 17.6099 47.8167 28.3070 28.5223 37.4879 45.0892 21.2032 11.6043 8.3817 42.0630 14.9931 44.8437 70.6664 29.0830 53.2324 42.5690 10.4856 6.9651 1.1849 21.8774 9.7164 36.3912 38.0084 22.3585 28.8253
temp: 298.150 k
press: 1.00000 atm
elementType: 8 7 6 6 6 6 6 6 6 6 6 6 6 6 6 6 6 6 6 6 6 6 6 1 1 1 1 1 1 1 1 1 1 1 1 1 1 1 1 1 1 1 1 1 1 1 1 1 1 1 1 1
symmnumber: 1
zpe: 1175163.8 jmol-1
zpe.correction: 0.447596 hartree
zpe.thermalcorrener: 0.471267 hartree
zpe.thermalcorrenthalpy: 0.472211 hartree
zpe.thermalcorrgfe: 0.391583 hartree
zpe.sumelectzpe: -945.816779 hartree
zpe.sumelectthermal: -945.793108 hartree
zpe.sumelectthermalent: -945.792164 hartree
zpe.sumelectthermalfe: -945.872792 hartree
dipole: 0.8267 -1.0615 -0.2087
dipole: 1.3615
quadrupole: -125.6644 -143.6606 -132.8629
quadrupole: 5.7050 1.9381 -0.3881
quadrupole: 8.3982 -9.5979 1.1997 5.7050 1.9381 -0.3881
hfenergy: -946.2643749 hartree
pointgroup: C01 [X(C21H29N1O1)]
dipole: 0.4239273 -0.1328999 -0.2992524 debye
polarizability: 262.3181335|42.0817154|232.1401281|34.0353786|-10.6004359|235.3190657 unknown
InChI: InChI=1S/C21H29NO/c1-4-10-19(17-23-16-15-22(5-2)6-3)21-14-9-12-18-11-7-8-13-20(18)21/h4,7-9,11-14,19H,1,5-6,10,15-17H2,2-3H3
charge 0 multiplicity 1
52 atoms
O  1.345058 0.57145 0.286111
N  5.081332 0.737906 0.449121
C  -1.05828 0.455656 -0.036611
C  -2.173534 0.21416 -1.059707
C  0.307775 0.571186 -0.749896
C  -1.317771 1.710121 0.859434
C  -3.011138 -0.968819 -1.035961
C  3.676301 0.674138 0.920734
C  2.698154 0.719612 -0.264387
C  -2.389512 1.172139 -2.063947
C  -4.035008 -1.132147 -2.05658
C  5.971516 1.56704 1.29926
C  5.62432 -0.591165 0.068633
C  -2.891469 -2.000901 -0.041902
C  -2.539208 1.564086 1.741664
C  -3.396333 1.010579 -3.062088
C  -4.204781 -0.125361 -3.061486
C  -4.869037 -2.299853 -2.04405
C  -3.719312 -3.125913 -0.054281
C  6.27976 1.015446 2.719163
C  6.908395 -0.504132 -0.777516
C  -4.718202 -3.28229 -1.065434
C  -2.532488 1.646889 3.09625
H  -0.966084 -0.407919 0.643814
H  0.36889 1.508359 -1.348516
H  0.456208 -0.289116 -1.439233
H  -0.416443 1.882449 1.474261
H  -1.442086 2.593194 0.197308
H  3.469247 1.543211 1.571601
H  3.459488 -0.237286 1.525227
H  2.799539 1.68568 -0.803224
H  2.909177 -0.100855 -0.98564
H  -1.772919 2.078585 -2.087082
H  5.502033 2.565152 1.391629
H  6.921502 1.723729 0.755507
H  4.845867 -1.104524 -0.526911
H  5.809614 -1.240799 0.961547
H  -2.143878 -1.907118 0.750929
H  -3.491189 1.374231 1.221808
H  -3.527438 1.783968 -3.826935
H  -4.980211 -0.261764 -3.824701
H  -5.633871 -2.404743 -2.823224
H  -3.605842 -3.894735 0.718056
H  5.352708 0.871992 3.304349
H  6.80933 0.046269 2.674988
H  6.923234 1.725097 3.272218
H  6.742309 0.146768 -1.654173
H  7.199229 -1.509516 -1.133792
H  7.759655 -0.097447 -0.202171
H  -5.360661 -4.169668 -1.065034
H  -1.605742 1.83005 3.655036
H  -3.450403 1.532732 3.684533
