program: Gaussian 09
title: 000201758
version: EM64L-G09RevD.01
frameworkgroup: C1[X(C14H20N2O5)]
method: RPBEPBE
basis: SDD
operation: Freq
keyword: #p
keyword: freq=noraman
keyword: PBEPBE/SDD
title: #p freq=noraman PBEPBE/SDD
converged: NO YES NO NO
title: Mulliken charges:
elementType: O O O O O N N C C C C C C C C C C C C C C H H H H H H H H H H H H H H H H H H H H
charge: -0.293949 -0.283826 -0.289364 -0.320832 -0.297551 -0.371800 -0.114445 0.379803 -0.551623 -0.518305 0.057037 0.240236 0.299729 -0.499145 0.179422 0.253012 -0.659604 -0.617616 -0.522129 -0.494496 -0.532859 0.287299 0.237178 0.257113 0.254657 0.329455 0.226092 0.226563 0.311351 0.280555 0.222962 0.228653 0.206994 0.268255 0.230560 0.211715 0.250317 0.226198 0.241302 0.232543 0.228545
chargesum: 0.00000
title: Mulliken charges with hydrogens summed into heavy atoms:
elementType: O O O O O N N C C C C C C C C C C C C C C
charge: -0.293949 -0.283826 -0.289364 -0.320832 -0.297551 -0.042345 -0.114445 0.379803 -0.264324 -0.281127 0.057037 0.240236 0.299729 0.012624 0.179422 0.253012 0.104402 0.114552 0.183680 0.193734 0.169530
polarizability: 2.64234445e+02 7.18261444e+00 2.11914650e+02 -9.81805988e+00 2.83933934e-01 1.18161973e+02
1716.lowfreq: -33.4453 -6.2705 0.0007 0.0010 0.0012 0.1730 5.4633 13.6819 27.0311
frequency: -33.4039 13.3630 26.9800 38.7346 57.7257 70.9550 84.9754 97.2645 99.3693 115.2947 145.7816 156.5532 159.8223 175.5443 185.7871 195.9048 218.4936 222.8228 229.5080 244.5918 254.4896 270.7844 303.3097 310.4601 335.8634 344.2807 378.8994 401.7038 420.4895 437.0163 439.3201 484.3690 526.6345 560.5197 564.6685 572.5561 598.4431 653.2603 665.7976 687.7196 734.1176 742.5602 755.4338 787.2628 854.3486 861.8092 881.2768 886.9621 947.0392 952.6432 981.8727 1017.9518 1054.1388 1065.2283 1075.6444 1096.2976 1107.0365 1108.9914 1112.6343 1117.9165 1142.8793 1150.7202 1153.9046 1157.5136 1161.1080 1189.5831 1219.7484 1233.3522 1244.6154 1256.3653 1310.8072 1344.4544 1385.2888 1394.7737 1400.3504 1411.2170 1418.1970 1441.5642 1443.0627 1446.3052 1451.6972 1453.3141 1455.9476 1464.9305 1465.6631 1466.8044 1473.7687 1478.3346 1484.1203 1488.6378 1499.1802 1507.1612 1521.6082 1558.6745 1592.4677 1593.8343 1604.9454 2957.0857 2968.6739 2969.9661 2971.5127 2986.0701 3034.2228 3046.5064 3048.3677 3061.4026 3082.3790 3082.6212 3093.1663 3118.4667 3118.9983 3126.7684 3126.9638 3127.7244 3151.9715 3175.0702 3563.8506
redmass: 2.9530 4.6218 5.0821 5.0360 4.4848 4.3618 3.6176 3.0225 2.2781 3.1904 1.4187 1.6436 1.8731 2.0567 1.7290 1.4611 1.4206 4.0406 4.2885 3.4336 3.1348 1.8009 5.3861 3.6887 4.8886 3.8406 4.5776 4.9872 2.4610 5.5219 2.6196 5.6450 5.8523 3.6548 5.1961 3.0117 1.7214 4.0834 4.7016 4.4064 4.3562 4.3824 4.6581 7.0536 1.5887 6.9256 3.6624 1.9334 9.0301 3.3412 4.7296 2.5103 2.9328 1.5566 5.2785 1.2241 1.2487 1.2481 1.2600 2.5001 1.3995 1.4040 1.4632 1.8162 1.5485 3.0767 1.5723 3.2771 1.4734 1.9423 4.1048 1.3856 4.5220 2.6106 3.3349 1.2347 1.2348 1.1677 1.1887 1.3385 1.1599 1.0946 1.1464 1.3246 1.1735 1.1177 1.0975 1.2150 1.0583 1.0720 1.2825 2.0225 1.0739 6.5194 5.5305 7.7620 6.4179 1.0371 1.0341 1.0338 1.0357 1.0327 1.0635 1.0987 1.1002 1.1043 1.0958 1.1028 1.0992 1.0980 1.0992 1.1020 1.1044 1.1049 1.0914 1.0909 1.0774
irintensity: 5.2413 1.0921 1.8021 7.0414 2.5515 2.7522 2.3372 9.3198 1.7669 8.9481 5.0724 2.6350 5.1079 4.0134 3.2092 1.0937 1.3836 1.4521 2.5753 2.8567 1.5313 2.8223 5.4585 10.8385 5.7936 11.2222 9.9897 23.6746 16.3548 8.1772 6.1780 0.3612 6.6078 7.6475 3.2470 28.9647 72.2178 14.8203 5.2264 13.7942 27.2111 6.1745 4.0110 12.1097 11.5520 10.4081 22.0726 26.9082 57.8643 7.7387 25.1892 21.5656 17.9806 19.9394 234.4623 2.0066 3.9868 18.4458 0.3909 7.4247 3.9899 7.9817 60.6263 25.9426 75.2967 53.8742 34.4897 8.0716 30.2254 34.6334 327.5404 26.4518 58.5237 75.3692 66.4005 53.2696 9.3273 25.1321 13.0697 21.3386 43.4971 17.6510 2.2552 144.1500 91.8870 50.4226 9.4279 63.0028 12.1293 17.5902 20.4128 162.4076 7.8438 297.7328 311.4111 5.4584 7.8750 79.4071 93.5197 58.0068 83.3843 77.7987 28.9983 49.7218 13.7089 38.3231 39.0816 7.7071 43.7213 3.1016 4.5767 26.9987 11.2200 20.6744 4.2545 4.9227 21.3317
temp: 298.150 k
press: 1.00000 atm
elementType: 8 8 8 8 8 7 7 6 6 6 6 6 6 6 6 6 6 6 6 6 6 1 1 1 1 1 1 1 1 1 1 1 1 1 1 1 1 1 1 1 1
symmnumber: 1
zpe: 862327.6 jmol-1
zpe.correction: 0.328443 hartree
zpe.thermalcorrener: 0.351035 hartree
zpe.thermalcorrenthalpy: 0.351979 hartree
zpe.thermalcorrgfe: 0.274890 hartree
zpe.sumelectzpe: -1029.467990 hartree
zpe.sumelectthermal: -1029.445398 hartree
zpe.sumelectthermalent: -1029.444454 hartree
zpe.sumelectthermalfe: -1029.521543 hartree
dipole: -2.3755 3.0575 -0.8591
dipole: 3.9660
quadrupole: -99.4630 -117.6778 -127.4862
quadrupole: 12.2535 3.2224 7.5273
quadrupole: 15.4127 -2.8021 -12.6105 12.2535 3.2224 7.5273
hfenergy: -1029.7964331 hartree
pointgroup: C01 [X(C14H20N2O5)]
dipole: -0.8911667 1.0877738 -0.6762137 debye
polarizability: 265.0968691|4.6563586|205.7486191|-5.3809211|-22.7175804|123.4655805 unknown
InChI: InChI=1S/C14H20N2O5/c1-16(2)12(17)8-15-14(18)9-6-10(19-3)13(21-5)11(7-9)20-4/h6-7,15H,8H2,1-5H3
charge 0 multiplicity 1
41 atoms
O  -4.245098 -0.214162 0.561345
O  -2.6432 -2.706735 0.655871
O  -3.005103 2.099136 -0.32932
O  1.840573 0.754909 -1.460191
O  4.508045 -2.053281 1.341255
N  2.116512 -1.332393 -0.481881
N  5.041335 0.097475 0.601224
C  -0.121985 -0.301209 -0.489154
C  -0.849303 0.908755 -0.609118
C  -0.778053 -1.47333 -0.065343
C  -2.901991 -0.246079 0.14451
C  -2.161541 -1.459188 0.248741
C  -2.216688 0.937537 -0.284326
C  3.552571 -1.395841 -0.789096
C  1.338184 -0.248428 -0.846065
C  4.409054 -1.127007 0.468645
C  4.91626 1.230803 -0.3380
C  5.921337 0.313439 1.765445
C  -5.249498 0.227117 -0.431996
C  -4.075914 -2.980121 0.859208
C  -2.331607 3.354721 -0.679664
H  -0.306553 1.792824 -0.952597
H  -0.281183 -2.446228 0.001333
H  3.745841 -0.704465 -1.621541
H  3.805237 -2.423455 -1.10459
H  1.740462 -2.052987 0.135603
H  4.936551 2.172056 0.240728
H  5.759197 1.254834 -1.057506
H  3.95922 1.200177 -0.884403
H  5.988206 -0.627887 2.331463
H  6.92976 0.621037 1.429803
H  5.511394 1.10371 2.423324
H  -5.241217 -0.445025 -1.312855
H  -5.055418 1.265765 -0.743315
H  -6.21621 0.153623 0.089166
H  -4.651442 -2.811418 -0.069537
H  -4.493804 -2.359994 1.666725
H  -4.104943 -4.047971 1.127609
H  -3.114242 4.124949 -0.616608
H  -1.520079 3.582309 0.036899
H  -1.920769 3.317928 -1.706491
