program: Gaussian 09
title: 000201764
version: EM64L-G09RevD.01
frameworkgroup: C1[X(C19H20N2O3)]
method: RPBEPBE
basis: SDD
operation: Freq
keyword: #p
keyword: freq=noraman
keyword: PBEPBE/SDD
title: #p freq=noraman PBEPBE/SDD
converged: YES YES NO NO
title: Mulliken charges:
elementType: O O O N N C C C C C C C C C C C C C C C C C C C H H H H H H H H H H H H H H H H H H H H
charge: -0.278640 -0.267946 -0.263278 -0.096992 -0.138394 -0.356072 -0.348431 -0.402690 -0.396558 -0.494805 0.508825 0.129576 -0.485843 -0.456713 0.263063 0.204717 0.158649 -0.327055 -0.373775 -0.338344 -0.204682 -0.223125 -0.241189 -0.229436 0.234521 0.210980 0.185067 0.214394 0.257177 0.226492 0.215036 0.244726 0.219371 0.200932 0.285639 0.237798 0.250073 0.264409 0.249761 0.240470 0.231224 0.230207 0.229731 0.231126
chargesum: 0.00000
title: Mulliken charges with hydrogens summed into heavy atoms:
elementType: O O O N N C C C C C C C C C C C C C C C C C C C
charge: -0.278640 -0.267946 -0.263278 -0.096992 -0.138394 0.089430 0.051031 0.080978 0.063205 -0.074502 0.508825 0.129576 -0.200203 -0.218914 0.263063 0.204717 0.158649 -0.076982 -0.109366 -0.088583 0.267012 0.007083 -0.011458 0.001690
polarizability: 3.26018540e+02 1.86586370e+01 2.01078927e+02 -2.97791210e+01 1.41861649e+01 1.57247231e+02
1716.lowfreq: -5.9326 -1.8839 -0.0006 0.0007 0.0009 5.2633 18.6302 25.9139 30.2668
frequency: 18.3953 25.5894 30.1639 44.2538 55.5580 76.1624 79.9142 96.3162 138.0088 157.3146 180.6499 199.4586 225.9341 258.2110 279.1103 290.3212 316.7780 333.5940 339.9184 375.4474 406.5680 412.1540 416.1084 421.3239 448.3273 470.9974 518.5250 543.7432 580.3273 604.8245 610.0190 614.3646 623.0578 676.5910 687.8744 702.0060 707.9901 717.1063 752.0356 766.7097 778.4678 787.0328 813.7652 837.5921 839.5848 860.1064 874.3782 892.4934 913.5492 931.4782 935.7956 944.1404 975.1052 982.2819 989.6928 994.0754 999.5907 1005.0534 1016.8658 1033.0482 1051.7175 1055.8029 1071.1706 1080.6416 1083.9869 1115.1425 1127.4007 1137.5038 1139.6781 1155.7574 1171.1164 1172.9330 1183.9602 1187.6294 1198.0527 1237.3480 1247.1315 1253.4974 1263.0179 1288.0817 1292.3093 1315.7714 1328.5398 1337.9877 1356.6514 1361.4708 1363.5317 1377.8515 1380.0114 1408.8186 1411.9507 1432.3002 1440.2197 1447.7284 1454.5333 1458.9745 1464.3113 1473.5951 1477.8238 1480.7786 1485.0152 1550.1474 1589.9725 1609.4418 1611.2829 1630.3093 2848.9775 2860.0802 2874.8955 2982.1678 2984.9647 2993.7583 2997.8113 3026.6041 3052.5268 3097.7307 3100.7555 3105.8386 3125.1545 3133.5452 3134.2767 3145.2365 3156.6287 3168.4199 3173.7615 3179.8068
redmass: 5.4539 5.0682 5.4686 5.4868 5.6467 4.0764 2.4377 3.9672 5.6784 4.4729 4.7126 3.8952 5.5709 3.7885 2.8170 3.6806 3.2407 3.3347 3.4376 4.5261 2.9054 3.7586 2.3731 2.9808 3.8303 3.0589 5.1695 4.6779 4.4529 5.6236 5.1207 5.4519 2.4981 9.0816 4.4607 5.9889 1.5727 4.8051 5.2658 3.6321 4.5301 2.2848 1.4693 3.8701 2.0275 1.2493 3.7803 1.5029 2.8467 1.3913 1.4383 2.2019 4.9348 1.3894 5.6567 2.4798 1.3401 2.0649 2.8838 2.0652 1.7396 3.3910 1.4975 1.8552 1.9098 1.8751 1.0746 2.0114 2.6726 2.3234 1.7139 1.0571 1.8372 1.1688 1.1341 1.6041 3.9363 1.7497 1.5292 1.4440 1.4935 1.3263 1.3914 1.2436 1.4564 1.3628 1.2784 1.8159 7.9421 2.6725 2.2540 2.2308 4.5593 1.1143 1.1161 1.1342 1.2372 1.3938 1.3747 2.3528 1.2841 8.2319 6.3268 6.0636 7.9789 8.2536 1.0702 1.0708 1.0696 1.0679 1.0868 1.0657 1.0609 1.0891 1.0896 1.0970 1.0950 1.1103 1.0849 1.0880 1.0898 1.0928 1.0961 1.1010 1.0927 1.0954
irintensity: 0.0372 0.4450 0.3120 0.0382 2.5327 1.2695 16.9946 0.6343 0.1567 1.7227 4.3917 1.8094 0.4664 1.0071 0.1967 0.2870 5.7632 8.8140 4.5535 13.2263 0.3058 1.5798 3.0087 9.1010 1.0311 1.0208 4.4679 12.9145 2.4258 2.0942 6.1376 0.6801 8.9824 0.6150 12.9336 8.5261 78.0050 1.2627 7.9462 11.9303 14.6895 38.2369 45.3085 23.8484 8.3376 1.4238 2.1098 21.2613 7.7587 2.1800 5.5258 4.1048 169.6912 2.1090 0.2854 81.2828 0.5305 30.6719 22.3312 8.8308 1.3796 18.6586 6.9090 10.3319 1.9623 57.0448 5.6435 27.4528 10.6318 3.9946 19.5283 0.1899 0.7982 8.2352 7.4469 1.1006 295.5309 71.0013 41.0893 45.4860 51.3454 1.6905 40.2518 0.2721 5.4947 5.9388 0.6166 15.1699 0.6218 29.6099 159.4028 10.9408 56.1677 28.8777 16.7442 7.4218 52.8953 53.0538 21.9891 6.1819 24.6699 232.3357 14.3169 2.6780 4.1394 0.2675 42.7512 80.6462 107.8197 32.4706 17.9171 43.8821 134.6621 47.1668 31.0069 4.9689 13.3667 31.0459 1.7597 3.4099 10.0867 24.0670 22.8419 20.1319 1.8275 6.0576
temp: 298.150 k
press: 1.00000 atm
elementType: 8 8 8 7 7 6 6 6 6 6 6 6 6 6 6 6 6 6 6 6 6 6 6 6 1 1 1 1 1 1 1 1 1 1 1 1 1 1 1 1 1 1 1 1
symmnumber: 1
zpe: 930166.5 jmol-1
zpe.correction: 0.354282 hartree
zpe.thermalcorrener: 0.374813 hartree
zpe.thermalcorrenthalpy: 0.375757 hartree
zpe.thermalcorrgfe: 0.302307 hartree
zpe.sumelectzpe: -1069.424650 hartree
zpe.sumelectthermal: -1069.404119 hartree
zpe.sumelectthermalent: -1069.403175 hartree
zpe.sumelectthermalfe: -1069.476625 hartree
dipole: -0.8099 -0.1809 -4.0973
dipole: 4.1805
quadrupole: -128.5175 -131.2644 -148.8101
quadrupole: 3.1201 -15.6492 -0.1447
quadrupole: 7.6798 4.9329 -12.6127 3.1201 -15.6492 -0.1447
hfenergy: -1069.7789316 hartree
pointgroup: C01[X(C19H20N2O3)]
dipole: -0.3260946 0.8142981 -1.3913195 debye
polarizability: 324.3587798|36.0132865|176.9142706|-13.7400148|25.7477795|183.0716473 unknown
InChI: InChI=1S/C19H20N2O3/c22-19(16-4-2-1-3-5-16)21-10-8-20(9-11-21)13-15-6-7-17-18(12-15)24-14-23-17/h1-7,12H,8-11,13-14H2
charge 0 multiplicity 1
44 atoms
O  3.193554 -0.860462 2.225262
O  -5.136583 -1.79493 -1.157547
O  -6.753771 -0.730556 0.260087
N  -0.510538 0.73721 -0.31015
N  2.020379 -0.535341 0.236036
C  -0.268909 0.080533 1.000216
C  0.747694 1.297155 -0.85414
C  0.770591 -1.044196 0.847026
C  1.804772 0.184815 -1.037363
C  -1.608034 1.733312 -0.264361
C  -2.979881 1.09709 -0.061253
C  3.193666 -0.53422 0.992091
C  -3.307512 -0.099483 -0.766243
C  -3.937738 1.71332 0.779494
C  4.492782 -0.183277 0.306164
C  -4.59359 -0.608394 -0.596025
C  -5.547424 0.017196 0.237492
C  -5.24822 1.181795 0.945406
C  5.434956 0.597586 1.022937
C  4.852474 -0.712391 -0.960878
C  -6.573866 -1.779409 -0.778804
C  6.700198 0.879325 0.465537
C  6.126491 -0.446703 -1.509881
C  7.049306 0.359464 -0.803787
H  -1.22006 -0.347193 1.36292
H  0.09111 0.815323 1.763391
H  1.174709 2.090089 -0.187104
H  0.539431 1.757657 -1.838401
H  1.027244 -1.471501 1.829345
H  0.355623 -1.834842 0.191964
H  1.444145 -0.527711 -1.806037
H  2.750471 0.629914 -1.381093
H  -1.594085 2.271352 -1.234255
H  -1.443023 2.505581 0.529202
H  -2.558256 -0.588484 -1.393984
H  -3.665836 2.626411 1.321388
H  -5.982973 1.655746 1.600954
H  5.166524 0.958031 2.021364
H  4.150964 -1.359148 -1.50047
H  -6.843141 -2.757292 -0.350775
H  -7.178405 -1.514313 -1.667054
H  7.417438 1.492003 1.022786
H  6.400459 -0.873261 -2.48119
H  8.035766 0.569903 -1.23197
