program: Gaussian 09
title: 000201717
version: EM64L-G09RevD.01
frameworkgroup: C1[X(C8H14NO)]
method: RPBEPBE
basis: SDD
operation: Freq
keyword: #p
keyword: freq=noraman
keyword: PBEPBE/SDD
title: #p freq=noraman PBEPBE/SDD
converged: NO YES NO NO
title: Mulliken charges:
elementType: O N C C C C C C C C H H H H H H H H H H H H H H
charge: -0.106786 -0.111636 -0.250661 -0.384112 -0.384081 -0.463452 -0.463477 -0.429639 0.133524 -0.540578 0.325092 0.293434 0.282670 0.282658 0.293433 0.273359 0.280558 0.280541 0.273371 0.304214 0.304247 0.269847 0.267627 0.269848
chargesum: 1.00000
title: Mulliken charges with hydrogens summed into heavy atoms:
elementType: O N C C C C C C C C
charge: -0.106786 -0.111636 0.074431 0.191992 0.192010 0.090465 0.090435 0.178822 0.133524 0.266744
polarizability: 9.17550343e+01 -1.25385166e+00 8.30063954e+01 -1.58530942e-03 -1.40579190e-04 7.57739882e+01
1716.lowfreq: -26.1774 -6.1484 -0.0006 0.0003 0.0007 19.1774 29.0972 135.6578 220.8425
frequency: 5.2797 135.6380 220.8086 242.1063 276.5001 276.9080 372.1944 388.8482 443.4813 482.3402 496.8360 501.7376 593.5549 638.7492 754.4383 808.5192 826.3284 869.3691 873.6651 887.4996 922.2156 927.7884 940.6925 1030.0914 1033.1997 1058.6471 1085.5019 1091.6927 1116.4128 1133.9486 1166.2499 1191.7352 1228.3979 1236.6710 1242.7635 1282.2148 1283.4545 1302.4533 1321.7953 1329.2966 1345.9082 1359.3680 1361.9264 1422.7306 1440.3797 1461.9412 1472.5918 1475.7559 1481.7364 1486.2198 1498.1726 1679.0771 3022.4551 3024.1460 3030.2262 3030.4265 3038.0276 3039.3005 3088.7802 3090.5648 3096.2573 3098.1920 3111.0497 3115.3431 3141.8668 3142.1722
redmass: 2.2491 2.9971 1.0246 1.8121 3.0463 2.3830 2.8374 2.2417 4.8991 3.5218 5.2527 4.5285 2.5554 4.9781 2.9228 1.3363 1.8529 2.2525 2.4359 4.1194 2.1785 2.5419 1.9318 2.0060 3.0486 3.0956 2.5650 2.5103 1.4815 1.3035 1.0492 2.0289 1.3217 1.2413 1.3848 1.3445 1.3102 1.4262 1.4482 1.2951 1.4557 1.3515 1.3356 1.0807 1.1619 1.0624 1.0548 1.0731 1.0768 1.0687 1.0846 11.1722 1.0365 1.0551 1.0596 1.0587 1.0613 1.0618 1.1066 1.1064 1.0889 1.1066 1.1077 1.1082 1.1051 1.1054
irintensity: 2.4184 2.6934 0.0000 0.4545 1.5347 0.1329 1.5425 0.0817 10.2221 1.9615 0.0933 0.0149 0.9373 0.6121 6.8740 8.1401 11.3018 4.9073 2.3964 20.5239 6.6371 4.6428 2.7366 1.4912 7.7183 52.7476 1.1216 0.1140 4.7207 0.6610 0.1451 17.1426 0.2755 0.6417 5.3312 1.2420 5.2461 3.8514 2.1365 0.2415 1.1982 13.8674 5.4804 9.8729 14.5114 3.3265 39.2516 3.2245 27.7475 48.4944 14.4957 168.5042 1.8734 0.5462 14.8371 0.3344 10.3528 7.2120 0.5633 0.4574 0.8801 0.4231 3.3519 7.6484 3.1657 2.4132
temp: 298.150 k
press: 1.00000 atm
elementType: 8 7 6 6 6 6 6 6 6 6 1 1 1 1 1 1 1 1 1 1 1 1 1 1
symmnumber: 1
zpe: 559700.6 jmol-1
zpe.correction: 0.213179 hartree
zpe.thermalcorrener: 0.222419 hartree
zpe.thermalcorrenthalpy: 0.223363 hartree
zpe.thermalcorrgfe: 0.177236 hartree
zpe.sumelectzpe: -442.174736 hartree
zpe.sumelectthermal: -442.165496 hartree
zpe.sumelectthermalent: -442.164551 hartree
zpe.sumelectthermalfe: -442.210678 hartree
dipole: 6.1740 -1.5486 0.0001
dipole: 6.3653
quadrupole: -52.1272 -51.1767 -49.3452
quadrupole: 8.3042 -0.0004 -0.0003
quadrupole: -1.2442 -0.2937 1.5379 8.3042 -0.0004 -0.0003
hfenergy: -442.3879143 hartree
pointgroup: C01 [X(C8H14N1O1)]
dipole: -2.4623349 0.4564562 -0.001471 debye
dipolederiv: -0.7732231 0.1733594 -0.0002623 0.2168271 -0.5451572 0.0002794 -0.0005893 0.0004188 -0.2260649 -0.458851 -0.0615958 -0.0000282 -0.0788336 -0.3612244 0.0000236 0.000014 0.0000253 -0.3164869 -0.0691295 0.0751281 -0.000095 0.0767615 -0.2546488 0.000245 -0.0000481 0.0001062 0.0803825 0.1227531 -0.0135166 0.0042612 0.0203191 0.2074631 0.090977 0.0373922 0.1176371 0.2766643 0.1227822 -0.0134184 -0.0043469 0.0203514 0.207236 -0.0909067 -0.0375252 -0.1175767 0.2769173 0.0708624 -0.0314295 0.0369297 0.0394086 0.0413489 -0.0173693 0.040261 0.0411272 0.0294628 0.0708736 -0.0314132 -0.0369071 0.0393115 0.041375 0.017397 -0.0403524 -0.0410985 0.0293903 -0.0643368 -0.2677043 0.0000681 -0.3904021 0.059046 -0.0000823 0.0002913 0.0000483 0.1193605 1.1279656 -0.0573634 0.0004664 -0.1671024 0.9190559 -0.0006514 0.0006172 -0.0006921 0.0363585 0.2999162 0.118644 0.0000029 0.1231974 0.1387821 0.000011 0.0000046 0.0000013 0.0746751 -0.0157895 -0.0470107 0.0000054 -0.0247035 0.0589388 0.000011 -0.0000255 -0.0000077 0.0693384 0.0760014 -0.0234665 0.0163285 -0.0648976 -0.0022325 0.0889095 0.0154441 0.0439139 0.02398 -0.0371214 0.0537452 -0.0051345 0.0573161 0.0459587 -0.0035097 -0.0656969 0.0105929 0.0849358 -0.0371589 0.0537588 0.0050002 0.0574026 0.045935 0.0035983 0.0655547 -0.0105125 0.0849762 0.0760189 -0.0234673 -0.0162824 -0.0648605 -0.0023782 -0.088914 -0.0153442 -0.0438939 0.024118 0.0471333 0.0506523 0.0173708 0.0055697 -0.0668579 -0.019235 0.0127048 0.0040811 0.0998366 0.037009 -0.0116525 -0.0496551 0.0115275 0.0808775 0.0580147 -0.052055 0.0223077 -0.0325666 0.0369355 -0.011568 0.0497249 0.0116359 0.0807643 -0.0581761 0.0521104 -0.0224854 -0.032389 0.0471623 0.0506015 -0.0174652 0.0055486 -0.0668725 0.0194952 -0.0127228 -0.0038447 0.0998063 0.0549153 -0.0126484 -0.0348336 0.0286418 0.1088257 -0.0233317 -0.0344654 -0.0628511 0.0331428 0.0548171 -0.0126316 0.034853 0.0286717 0.1089632 0.0232142 0.0344374 0.0627048 0.033087 0.0869897 0.0117367 -0.052856 -0.0223865 0.0819464 0.0559526 0.0018842 0.0836063 0.0010672 0.0365242 0.0194008 -0.0000478 0.0930446 -0.0089214 0.000114 -0.0000913 0.000089 0.1287311 0.0869504 0.0118593 0.0529029 -0.0223491 0.0817763 -0.0560663 -0.0017998 -0.0836972 0.0012764 unknown
polarizability: 91.8771707|-0.6990312|82.8842484|0.0095326|-0.0063966|75.7739987 unknown
InChI: InChI=1S/C8H14NO/c1-9-4-2-7(3-5-9)8(10)6-9/h7H,2-6H2,1H3
charge 1 multiplicity 1
24 atoms
O  2.421201 -1.280764 0.002263
N  -1.145636 -0.320086 -0.000143
C  1.199837 0.881596 -0.000098
C  -1.002945 0.572609 1.256793
C  -1.002083 0.571091 -1.258073
C  0.386904 1.273569 1.268705
C  0.387829 1.27193 -1.269986
C  -0.013169 -1.356217 0.000928
C  1.356393 -0.633894 0.000827
C  -2.501417 -1.014183 -0.000188
H  2.189095 1.363553 -0.000039
H  -1.149159 -0.088461 2.127012
H  -1.838454 1.29077 1.220288
H  -1.837554 1.289362 -1.222921
H  -1.147828 -0.090992 -2.127599
H  0.258513 2.368872 1.283845
H  0.945353 0.996848 2.177875
H  0.946891 0.993916 -2.178386
H  0.259546 2.367222 -1.286709
H  -0.110911 -1.994114 -0.895007
H  -0.111473 -1.99284 0.897708
H  -2.587504 -1.640955 0.900764
H  -3.297659 -0.253774 -0.000925
H  -2.586876 -1.64206 -0.900429
