program: Gaussian 09
title: 000201733
version: EM64L-G09RevD.01
frameworkgroup: C1[X(C19H26N2O)]
method: RPBEPBE
basis: SDD
operation: Freq
keyword: #p
keyword: freq=noraman
keyword: PBEPBE/SDD
title: #p freq=noraman PBEPBE/SDD
converged: YES YES NO NO
title: Mulliken charges:
elementType: O N N C C C C C C C C C C C C C C C C C C C H H H H H H H H H H H H H H H H H H H H H H H H H H
charge: -0.256827 -0.074929 -0.606034 0.140392 -0.483580 -0.463912 0.320500 -0.436483 0.112795 0.146823 -0.360271 -0.729444 -0.414613 0.397681 -0.282916 -0.348528 -0.472485 -0.440979 -0.309151 -0.616827 -0.629268 -0.248099 0.213424 0.204799 0.255597 0.229652 0.251202 0.225133 0.205651 0.168870 0.232620 0.219586 0.218510 0.255595 0.227302 0.269350 0.240796 0.336553 0.326788 0.238464 0.232739 0.223449 0.221492 0.183291 0.216977 0.246227 0.181531 0.230557
chargesum: 0.00000
title: Mulliken charges with hydrogens summed into heavy atoms:
elementType: O N N C C C C C C C C C C C C C C C C C C C
charge: -0.256827 -0.074929 0.057306 0.140392 -0.065356 0.021337 0.320500 0.039852 0.112795 0.146823 0.014250 -0.058728 -0.159017 0.397681 -0.055614 -0.079177 -0.231690 -0.202515 -0.076411 0.011404 0.015467 -0.017542
polarizability: 2.86414408e+02 -9.48289801e+00 2.29976408e+02 -4.86927362e+00 -1.45466230e+01 1.52714809e+02
1716.lowfreq: -23.1946 -7.4206 -0.0009 -0.0008 -0.0004 3.1271 10.1235 27.6962 46.9748
frequency: -18.4242 27.5544 46.7453 59.4316 71.4847 76.9016 93.0731 115.2083 132.0300 150.5177 159.4225 173.0676 178.2827 191.9211 203.8711 226.1490 237.6387 261.0805 281.5645 318.9686 320.9857 336.6134 353.1896 363.8062 396.6196 429.1337 430.8288 459.0909 473.9817 483.0726 517.1099 525.5926 532.6823 544.4513 581.9046 588.1089 613.9060 655.5755 661.0149 741.5109 742.8846 750.4411 765.9947 784.0184 788.6237 797.3740 813.6057 820.5136 848.2981 881.4982 889.8449 916.4742 952.2457 968.5137 971.9862 988.2499 999.6596 1009.1477 1023.1958 1032.4842 1037.0999 1047.9017 1055.8759 1063.6653 1074.7222 1082.5106 1092.7148 1105.2001 1122.1889 1145.0576 1147.7582 1155.1005 1174.7501 1180.6036 1186.5514 1223.7821 1231.3494 1239.5126 1260.1751 1276.4752 1281.6138 1284.4975 1297.4270 1307.5912 1316.3703 1336.0753 1354.7646 1363.9898 1377.0516 1390.8983 1402.3238 1412.2277 1417.8798 1440.8483 1442.9146 1456.1297 1458.6356 1461.2123 1468.3048 1473.6071 1476.8494 1477.6556 1480.7994 1485.0573 1487.2699 1496.2882 1517.0090 1575.5903 1585.8427 1601.0507 1625.5552 1630.6873 2803.3913 2836.6577 2853.3679 2971.2227 2979.6825 2992.7654 3002.8089 3015.1789 3024.4392 3026.9736 3031.3383 3060.9749 3069.0262 3073.5230 3074.5507 3087.7387 3090.9338 3119.8930 3122.8815 3135.0372 3145.6063 3155.5567 3169.1970 3172.1947 3505.8762 3660.7263
redmass: 2.6231 3.7988 4.5560 3.6244 3.6376 5.3424 2.4068 2.2210 3.7227 2.4020 3.8213 4.5262 4.0388 1.7926 2.6495 1.1074 1.1543 2.4407 3.0295 2.7238 2.7076 2.3172 3.5846 3.0856 3.1639 3.1994 3.0824 2.9615 3.2673 3.3705 4.7330 5.1204 2.5220 1.1821 2.2308 2.4980 2.3648 3.9128 3.9080 4.3048 1.6832 1.2510 1.3132 3.3897 2.0723 2.5379 2.2376 2.5020 1.6631 1.5225 2.8151 1.5151 1.9834 1.7872 1.6542 1.3875 1.3950 2.6767 2.3226 1.5769 2.3397 2.8895 1.8505 2.8126 2.1176 2.3505 1.4009 1.7818 1.9153 1.7574 2.4413 1.5329 1.7424 1.2650 1.2564 1.6877 1.9837 1.7458 2.3640 1.5474 1.5198 1.4685 1.2604 1.3496 2.0450 1.3637 1.4609 2.4096 1.4196 1.2094 2.7608 3.9700 1.1449 1.1601 2.3920 1.9000 1.0799 1.0680 1.1444 1.0649 1.0519 1.0621 1.0745 1.0638 1.0603 1.0789 3.4846 1.8153 5.9797 4.9862 2.6979 6.0055 1.0703 1.0578 1.0578 1.0595 1.0364 1.0847 1.0606 1.0712 1.0627 1.0970 1.0721 1.0989 1.1036 1.0980 1.1008 1.1013 1.1001 1.0869 1.0862 1.0898 1.0946 1.0962 1.0946 1.0967 1.0444 1.1043
irintensity: 0.3588 0.0720 0.2438 0.1798 0.1560 14.1803 0.5994 0.1211 0.3862 1.7105 0.8585 0.2972 0.4276 1.9412 2.4991 0.7998 0.8591 6.8018 0.6331 3.0931 6.5302 4.0644 3.5200 1.1283 3.7642 4.7737 1.9920 2.4062 0.7661 3.7847 4.3826 8.0460 8.9710 179.6389 25.5627 20.6952 33.0649 1.5544 1.9228 6.9661 26.3385 1.5582 10.0968 2.4410 69.9837 4.9296 7.4798 65.8041 7.0363 3.2884 1.1279 1.3115 1.7372 7.0492 0.1413 1.9437 0.7927 15.7701 9.2306 15.4564 13.3604 2.3396 1.1178 2.5858 20.1835 3.6442 6.8140 10.7681 2.6356 1.3070 6.7059 2.2012 12.0520 1.7617 0.4830 11.0810 3.1047 2.5573 3.6631 17.4979 6.9835 22.3856 13.4186 22.9650 53.5995 2.5770 9.1449 5.9580 21.0948 19.5147 5.2254 5.3983 1.9553 3.8630 8.8863 1.3086 9.3163 16.6703 2.3285 4.3433 10.2495 4.0131 13.1215 15.0561 17.6819 1.6342 13.9859 81.9254 10.5347 12.9737 201.5783 7.8719 75.3670 71.9204 230.2466 19.6384 26.6020 23.6732 19.4989 48.8288 6.9167 12.6399 45.3021 2.9340 45.7502 25.2112 51.5692 53.7998 42.8340 1.7512 2.3452 13.4292 29.4670 32.5169 20.0279 7.8950 25.8677 30.5172
temp: 298.150 k
press: 1.00000 atm
elementType: 8 7 7 6 6 6 6 6 6 6 6 6 6 6 6 6 6 6 6 6 6 6 1 1 1 1 1 1 1 1 1 1 1 1 1 1 1 1 1 1 1 1 1 1 1 1 1 1
symmnumber: 1
zpe: 1076804.8 jmol-1
zpe.correction: 0.410133 hartree
zpe.thermalcorrener: 0.431739 hartree
zpe.thermalcorrenthalpy: 0.432683 hartree
zpe.thermalcorrgfe: 0.360243 hartree
zpe.sumelectzpe: -922.699557 hartree
zpe.sumelectthermal: -922.677951 hartree
zpe.sumelectthermalent: -922.677007 hartree
zpe.sumelectthermalfe: -922.749447 hartree
dipole: 1.1821 2.5923 -2.6743
dipole: 3.9076
quadrupole: -121.8598 -133.3910 -131.1822
quadrupole: -3.7921 2.3084 0.5881
quadrupole: 6.9512 -4.5800 -2.3712 -3.7921 2.3084 0.5881
hfenergy: -923.10969 hartree
pointgroup: C01 [X(C19H26N2O1)]
dipole: -0.4513041 1.1630836 0.8983402 debye
polarizability: 286.2359803|8.6465107|232.5116831|-8.0863579|2.6565609|150.3579614 unknown
InChI: InChI=1S/C19H26N2O/c1-4-19(18(20)22,13-8-14-21(2)3)17-12-7-10-15-9-5-6-11-16(15)17/h5-7,9-12H,4,8,13-14,20H2,1-3H3
charge 0 multiplicity 1
48 atoms
O  0.802427 -2.533582 0.540207
N  5.450642 0.109596 -0.217577
N  0.123206 -0.987401 2.119005
C  0.304331 -0.210484 -0.238477
C  1.615421 0.638153 -0.04316
C  0.288185 -0.836738 -1.676517
C  -0.97804 0.633991 -0.00667
C  2.935702 -0.140992 -0.24063
C  0.41038 -1.359892 0.81929
C  -2.295502 0.009702 0.050979
C  4.151308 0.732387 0.132565
C  0.412234 0.187548 -2.823623
C  -0.906936 2.03218 0.101657
C  -3.473518 0.850364 0.190559
C  -2.06767 2.852634 0.247902
C  -2.50745 -1.412744 -0.010174
C  -3.332373 2.273565 0.284639
C  -4.77768 0.253642 0.242064
C  -3.788804 -1.965421 0.047748
C  6.56567 1.070896 -0.098564
C  5.723313 -1.133997 0.5321
C  -4.940813 -1.129181 0.168885
H  1.602015 1.480821 -0.760323
H  1.609487 1.08369 0.972983
H  1.100174 -1.582484 -1.730381
H  -0.649917 -1.402553 -1.810422
H  2.922595 -1.063156 0.367367
H  3.049526 -0.454957 -1.294948
H  4.087314 1.691477 -0.42016
H  4.097866 0.986051 1.227396
H  -0.356587 0.978357 -2.747504
H  0.276405 -0.320242 -3.795935
H  1.404564 0.673904 -2.8463
H  0.063208 2.533354 0.065133
H  -1.950186 3.939247 0.322675
H  -1.656242 -2.093367 -0.08965
H  -4.232469 2.89122 0.38758
H  -0.282038 -0.076173 2.331676
H  0.204194 -1.68775 2.855693
H  -5.648955 0.9120 0.343883
H  -3.910054 -3.053208 0.001621
H  6.370422 1.949909 -0.739139
H  7.502972 0.598489 -0.44393
H  6.731062 1.436396 0.948495
H  6.695135 -1.548801 0.209873
H  4.949385 -1.88997 0.321141
H  5.763888 -0.976871 1.641616
H  -5.940499 -1.575211 0.209147
