program: Gaussian 09
title: 000201727
version: EM64L-G09RevD.01
frameworkgroup: C1[X(C19H23NO3)]
method: RPBEPBE
basis: SDD
operation: Freq
keyword: #p
keyword: freq=noraman
keyword: PBEPBE/SDD
title: #p freq=noraman PBEPBE/SDD
converged: NO YES NO NO
title: Mulliken charges:
elementType: O O O N C C C C C C C C C C C C C C C C C C C H H H H H H H H H H H H H H H H H H H H H H H
charge: -0.246672 -0.413240 -0.203957 -0.087933 0.068449 -0.424073 -0.374777 0.396164 -0.334909 -0.345771 -0.783768 0.086937 0.158368 -0.325762 -0.320749 -0.404675 0.396294 -0.337741 -0.275002 -0.470670 -0.439802 -0.305025 -0.245604 0.242799 0.223871 0.176363 0.234095 0.188053 0.206535 0.215052 0.186786 0.223197 0.234589 0.254268 0.193282 0.212769 0.212882 0.193261 0.247641 0.244245 0.226981 0.239937 0.238855 0.379932 0.228380 0.230148
chargesum: 0.00000
title: Mulliken charges with hydrogens summed into heavy atoms:
elementType: O O O N C C C C C C C C C C C C C C C C C C C
charge: -0.246672 -0.033308 -0.203957 -0.087933 0.068449 0.042597 0.035681 0.396164 0.059679 0.056067 -0.071715 0.086937 0.158368 0.080289 0.085394 -0.157033 0.396294 -0.093497 -0.048021 -0.230733 -0.200947 -0.076645 -0.015456
polarizability: 2.08820731e+02 3.49185355e+01 2.11085765e+02 3.09662814e+00 5.36746501e+00 2.31225990e+02
1716.lowfreq: -15.1753 -5.6101 -0.0005 0.0001 0.0003 3.5937 8.8186 26.1319 38.7266
frequency: -12.0659 25.7858 38.7032 49.7796 60.4373 77.1041 109.8322 128.8392 138.2489 173.8169 184.4686 212.5634 221.8702 240.5020 250.5797 299.7879 302.2921 308.9873 319.5036 329.2537 374.0150 384.8509 405.1794 434.6951 439.2507 450.3046 469.9899 473.4613 514.0300 524.2731 544.0154 591.7952 593.0702 615.1078 625.1601 658.2116 672.5946 729.9578 747.1137 756.3091 766.0732 784.8312 789.0688 798.7484 810.8518 818.9405 840.2877 853.2962 882.7341 898.3016 915.6117 928.1940 964.5725 974.2913 986.1517 994.6097 998.2042 1004.0375 1015.5084 1027.9902 1036.3670 1050.3897 1055.5713 1076.6167 1083.8529 1095.0377 1115.3744 1130.5847 1137.1464 1147.9388 1151.4934 1163.2374 1181.7787 1189.8440 1194.1429 1222.9633 1236.7589 1244.3769 1261.1131 1270.0729 1276.3452 1279.3515 1291.1306 1302.5238 1313.1027 1332.5547 1346.1342 1362.3576 1367.4101 1371.9172 1383.9151 1392.8537 1403.2448 1413.9769 1441.8235 1443.4343 1446.4817 1451.2539 1456.2687 1457.7648 1460.0372 1473.9010 1481.6439 1487.4524 1518.4429 1589.2172 1602.5583 1632.5768 1649.1889 2847.7536 2851.6976 2867.6426 2954.9763 2958.8757 2990.7100 3017.6352 3027.6826 3032.8653 3040.4266 3079.5449 3082.7419 3084.0272 3088.8656 3103.0123 3121.0790 3124.5748 3134.2781 3147.6810 3155.4556 3170.8390 3172.4046 3496.8175
redmass: 2.9800 5.1940 4.7415 9.8766 4.5957 4.9750 3.3872 4.4176 4.7068 2.9857 3.5040 3.8424 3.8764 1.8753 3.1749 2.1566 2.0530 1.7875 3.7928 3.0116 3.5654 2.3835 2.5083 3.4949 3.9540 5.6346 2.8063 3.2486 6.3147 5.9165 3.5185 2.7261 3.1062 2.4600 1.3941 4.0452 3.6378 4.6419 1.2850 3.4820 1.5092 3.4144 2.8174 2.3258 2.8000 2.1668 1.6019 2.4220 1.8423 2.3918 2.0928 1.7603 1.3822 1.9247 1.3694 1.3961 2.6651 2.9961 2.4274 2.1617 2.4240 2.8578 2.0168 2.4602 3.1925 2.4206 2.5195 2.4033 2.4761 1.6588 2.5256 1.6061 1.1244 1.0805 1.5489 1.4048 1.8428 1.6257 1.3812 1.4495 1.5570 1.9541 1.3491 1.2370 1.3905 1.2620 1.2736 1.4136 2.4119 1.2686 1.1877 1.4190 2.7179 4.6763 2.4397 1.0826 1.0803 1.0972 1.4973 1.1837 1.3116 1.0972 1.0658 1.0601 3.6389 7.4656 5.1536 6.4107 8.9221 1.0705 1.0705 1.0689 1.0663 1.0664 1.0351 1.0660 1.0889 1.0845 1.0875 1.0963 1.0981 1.0996 1.0998 1.1014 1.0866 1.0865 1.0895 1.0944 1.0956 1.0967 1.0945 1.0637
irintensity: 0.0900 0.1244 0.3163 1.8716 0.0559 0.7799 0.1760 0.7576 0.3816 3.6714 0.7950 1.2507 2.7694 1.7674 0.9493 7.0690 2.9705 1.2091 0.3996 4.9245 3.3461 3.8099 4.6286 1.7977 6.3685 6.9619 0.8629 0.5231 5.0908 3.2265 15.0133 17.4721 5.7595 17.9572 101.5779 5.6632 7.2108 37.7353 7.1006 3.4455 5.9597 16.5267 47.3326 20.2409 59.6013 10.8442 0.2197 3.5295 3.7823 6.1592 10.7245 4.0091 2.0835 10.1978 3.7281 3.0522 46.0992 6.8643 219.6733 6.3069 3.4353 15.6086 5.9091 3.6608 30.9060 17.4232 10.3646 81.9380 23.5190 0.9184 4.4710 2.5429 0.8428 2.3299 2.3026 8.3767 5.1142 12.9879 7.3093 3.7856 3.6047 6.0357 3.9929 16.1922 10.2376 6.5806 11.1887 4.2569 8.9433 2.8610 23.7682 4.1146 4.1040 2.5602 4.9036 2.3018 3.0957 20.1740 1.3137 2.1417 1.2111 2.1746 15.5751 16.4752 10.1577 1.8055 6.0826 0.4050 193.0613 38.2169 54.0637 152.0759 33.1031 94.6326 17.6784 8.1045 13.0559 46.5281 39.0027 40.8199 36.0352 15.5055 38.5731 18.9058 1.4424 2.6725 11.8757 26.7183 35.2257 23.6705 7.4006 25.1188
temp: 298.150 k
press: 1.00000 atm
elementType: 8 8 8 7 6 6 6 6 6 6 6 6 6 6 6 6 6 6 6 6 6 6 6 1 1 1 1 1 1 1 1 1 1 1 1 1 1 1 1 1 1 1 1 1 1 1
symmnumber: 1
zpe: 1002190.4 jmol-1
zpe.correction: 0.381714 hartree
zpe.thermalcorrener: 0.401858 hartree
zpe.thermalcorrenthalpy: 0.402802 hartree
zpe.thermalcorrgfe: 0.332841 hartree
zpe.sumelectzpe: -1016.518067 hartree
zpe.sumelectthermal: -1016.497924 hartree
zpe.sumelectthermalent: -1016.496979 hartree
zpe.sumelectthermalfe: -1016.566941 hartree
dipole: -0.3677 -0.0737 0.0528
dipole: 0.3788
quadrupole: -161.2543 -126.4444 -123.6815
quadrupole: 15.8123 1.7746 -3.5867
quadrupole: -24.1276 10.6823 13.4452 15.8123 1.7746 -3.5867
hfenergy: -1016.8997812 hartree
pointgroup: C01 [X(C19H23N1O3)]
dipole: -0.1456545 -0.024692 0.0195111 debye
polarizability: 209.7028679|34.8218415|211.8122521|-1.5634248|8.668753|229.6173654 unknown
InChI: InChI=1S/C19H23NO3/c1-19(18(21)22,9-10-20-11-13-23-14-12-20)17-8-4-6-15-5-2-3-7-16(15)17/h2-8,21H,9-14H2,1H3
charge 0 multiplicity 1
46 atoms
O  5.755422 -1.030872 0.124526
O  -0.421142 2.740468 -2.051483
O  -2.353885 2.931383 -0.794413
N  2.929824 -0.326183 0.098582
C  -0.441195 1.667637 0.170176
C  0.900574 1.063229 -0.369207
C  1.635193 0.156435 0.642636
C  -1.374899 0.561231 0.727548
C  3.988233 0.716753 0.09139
C  3.421676 -1.538039 0.80645
C  -0.111802 2.770696 1.230896
C  -1.199397 2.470079 -0.908837
C  -1.967395 -0.435251 -0.148533
C  5.26426 0.171073 -0.569887
C  4.700081 -2.058492 0.130276
C  -1.62306 0.475271 2.102943
C  -2.783474 -1.488887 0.43199
C  -1.804301 -0.439836 -1.577401
C  -2.427688 -0.560478 2.66892
C  -2.996518 -1.529881 1.848406
C  -3.378326 -2.480535 -0.416794
C  -2.397395 -1.417154 -2.379442
C  -3.191238 -2.453046 -1.798493
H  0.72378 0.462405 -1.275953
H  1.546904 1.90485 -0.676384
H  1.780424 0.682349 1.620969
H  1.008315 -0.730573 0.848634
H  4.229994 1.054236 1.132406
H  3.639029 1.596815 -0.478457
H  2.639206 -2.319153 0.763904
H  3.641614 -1.326262 1.884038
H  0.48165 2.35779 2.063213
H  0.489137 3.568113 0.757955
H  -1.033729 3.222445 1.633775
H  5.053929 -0.071246 -1.633998
H  6.087532 0.902204 -0.510023
H  5.124049 -2.913634 0.682385
H  4.468708 -2.362726 -0.913349
H  -1.200259 1.219425 2.782387
H  -1.210155 0.33645 -2.066261
H  -2.592718 -0.580602 3.751544
H  -3.616717 -2.330077 2.269367
H  -3.990942 -3.263997 0.04546
H  -0.955644 3.317936 -2.663206
H  -2.254208 -1.388598 -3.465213
H  -3.651045 -3.214349 -2.437842
