program: Gaussian 09
title: 000201766
version: EM64L-G09RevD.01
frameworkgroup: C1[X(C21H24N2O6)]
method: RPBEPBE
basis: SDD
operation: Freq
keyword: #p
keyword: freq=noraman
keyword: PBEPBE/SDD
title: #p freq=noraman PBEPBE/SDD
converged: YES YES NO NO
title: Mulliken charges:
elementType: O O O O O O N N C C C C C C C C C C C C C C C C C C C C C H H H H H H H H H H H H H H H H H H H H H H H H
charge: -0.295550 -0.269350 -0.265565 -0.291273 -0.342500 -0.446474 -0.095399 -0.144710 -0.358465 -0.352810 -0.392994 -0.404420 -0.492077 0.506777 0.126671 0.355352 -0.484569 -0.458008 0.204055 0.158119 -0.326223 -0.554710 -0.489154 0.248907 0.288870 -0.202694 0.000014 -0.519735 -0.519183 0.199395 0.212734 0.235788 0.192239 0.221360 0.254415 0.252480 0.220183 0.221287 0.196773 0.287086 0.237389 0.249457 0.281670 0.277017 0.237332 0.234673 0.389769 0.266532 0.213563 0.228716 0.240999 0.230001 0.236236
chargesum: 0.00000
title: Mulliken charges with hydrogens summed into heavy atoms:
elementType: O O O O O O N N C C C C C C C C C C C C C C C C C C C C C
charge: -0.295550 -0.269350 -0.265565 -0.291273 -0.342500 -0.056705 -0.095399 -0.144710 0.053664 0.075217 0.082781 0.068243 -0.074016 0.506777 0.126671 0.355352 -0.197483 -0.220619 0.204055 0.158119 -0.076766 -0.273040 -0.212137 0.248907 0.288870 0.269312 0.000014 0.189077 0.188052
polarizability: 3.24059471e+02 -1.85133572e+01 2.82997740e+02 2.10975451e+01 -1.76756580e+01 2.09809838e+02
1716.lowfreq: -39.8696 -11.3011 -5.7646 -0.0009 -0.0008 -0.0005 1.7535 13.0223 17.5074
frequency: -39.7551 12.7908 17.4005 23.9415 32.1543 48.3199 58.0519 61.1238 72.8506 77.5146 117.6931 130.2410 132.9940 154.3668 166.0630 175.3288 181.4364 212.4630 216.9643 224.1948 262.8406 271.8239 277.6180 290.0480 305.1992 311.8354 322.8901 333.3326 348.4061 367.0612 389.9933 410.0897 420.7693 429.3060 462.4939 465.9664 494.3212 511.4764 522.6848 524.5088 561.0405 576.0879 590.1717 600.6330 609.8153 630.3816 668.2872 678.2240 716.3133 723.2287 726.6243 738.1890 752.6091 769.4851 779.3506 811.8080 817.0636 839.3964 841.9330 862.6107 864.4169 890.6466 892.2076 910.8059 922.2940 930.3467 946.5445 977.7173 990.9858 997.9188 1005.9291 1040.4682 1050.4278 1057.0750 1065.7614 1067.2172 1083.9499 1112.9517 1114.2630 1118.0508 1120.0221 1126.3043 1137.3393 1143.6315 1155.3299 1161.4081 1171.9393 1184.5481 1187.9207 1198.2045 1209.7003 1223.3662 1244.7610 1250.3551 1261.1596 1274.4724 1281.9395 1294.1115 1305.6435 1327.4283 1340.9298 1355.9842 1364.0925 1365.8247 1379.0697 1401.4173 1408.0277 1410.7732 1424.9018 1439.3024 1440.9552 1447.0917 1450.7051 1455.8658 1456.2859 1459.4146 1463.1072 1463.7129 1472.6719 1472.9298 1478.4010 1479.1634 1488.2034 1494.3694 1543.3864 1603.1892 1609.6159 1611.1762 1630.4228 2848.0632 2854.0273 2871.2175 2972.7697 2980.3815 2982.6870 2985.5645 2987.3812 3008.4726 3032.6478 3046.4848 3065.4226 3088.1123 3090.3216 3095.0868 3106.2999 3130.5210 3131.9859 3134.0526 3167.8723 3174.4050 3174.7580 3180.0056 3479.0252
redmass: 2.4308 5.0293 5.8077 5.2256 5.2796 3.7573 5.2091 2.9559 2.9634 4.6561 5.4784 3.4205 2.5920 2.6159 3.4475 3.0068 2.2652 2.4217 2.9452 4.8834 3.2797 3.3054 3.8869 2.3765 5.9085 3.9374 4.6074 2.6721 5.2480 5.2019 3.6840 2.3672 3.0124 4.8010 5.6573 2.8857 5.8479 1.1668 5.6382 4.9110 4.6355 4.9378 5.4089 5.6265 4.5888 2.3684 4.4003 9.4806 4.7979 9.4707 5.8016 3.3582 5.3838 3.9510 4.0940 1.7451 3.0181 1.7131 6.6121 6.5300 1.5693 1.5212 1.4855 2.7934 4.0359 1.3761 2.4681 5.1021 3.8815 3.1081 1.8966 2.5484 1.7425 3.5560 4.6694 1.4604 2.2960 2.0571 1.2498 1.2543 1.0444 2.0351 2.3277 2.5257 1.3811 1.4382 1.7141 1.9379 2.2657 1.1690 1.7426 1.6409 1.8837 3.8140 1.4640 1.5130 1.3821 1.5295 3.1195 1.4060 1.2480 1.3969 1.3566 1.3269 1.8576 2.9320 2.6357 2.2678 2.5720 1.2650 4.6102 1.1472 1.5565 1.0789 1.1074 1.1550 1.1783 1.0507 1.1578 1.3966 1.0566 1.5327 1.2261 3.1935 8.1319 7.5146 6.5887 7.9595 8.2691 1.0714 1.0702 1.0695 1.0320 1.0344 1.0678 1.0861 1.0668 1.0543 1.0894 1.0890 1.1047 1.1178 1.0975 1.0965 1.0945 1.1010 1.1053 1.0898 1.0914 1.0928 1.0916 1.0954 1.0641
irintensity: 14.3592 0.4529 0.1948 0.2213 0.8437 3.6349 3.3644 5.4919 1.2381 4.6440 0.5057 2.2743 1.3831 0.8689 3.3683 4.4186 1.0186 1.0595 2.7641 0.1408 0.4269 0.5769 1.4929 0.2749 1.7514 6.0599 3.0459 12.8540 10.1650 10.5915 0.8732 0.6608 10.7067 8.0703 1.2490 2.4807 9.8651 127.6818 5.4441 7.2804 3.7180 19.1670 3.3367 9.7541 3.2666 10.1146 5.0796 0.9630 1.4112 12.2636 17.6137 25.6931 9.2697 18.2869 14.7869 39.2488 9.8296 2.1413 30.6232 49.4905 17.5081 20.3179 27.7814 12.2571 4.5546 1.9853 5.1512 179.6753 116.5725 12.8303 7.8293 11.2443 2.8911 19.1687 199.1350 4.5681 8.2243 41.7863 5.9915 0.0344 0.3201 13.8729 12.9976 26.9428 2.4906 31.7953 35.2483 53.5416 147.0841 15.4479 71.4048 52.6986 50.2925 176.8956 5.4545 263.7214 18.4279 23.1414 275.4079 50.3109 0.2769 3.9183 13.6165 14.0747 19.0575 143.3029 118.0608 29.9738 66.1574 22.6679 53.1841 41.2280 44.4807 18.8718 7.0802 9.3717 35.2598 16.5826 46.9056 75.9067 23.4261 38.7191 15.8991 25.6810 276.2384 50.1272 29.6618 5.2214 0.1851 38.1317 50.9831 143.9440 54.4883 82.3295 23.0733 27.9408 47.6223 131.6743 58.6643 23.9678 37.0546 33.1411 35.3911 5.7136 8.5992 24.0073 13.5671 10.2128 2.2960 1.8023 2.4344 6.2366 112.8841
temp: 298.150 k
press: 1.00000 atm
elementType: 8 8 8 8 8 8 7 7 6 6 6 6 6 6 6 6 6 6 6 6 6 6 6 6 6 6 6 6 6 1 1 1 1 1 1 1 1 1 1 1 1 1 1 1 1 1 1 1 1 1 1 1 1
symmnumber: 1
zpe: 1103136.0 jmol-1
zpe.correction: 0.420162 hartree
zpe.thermalcorrener: 0.446883 hartree
zpe.thermalcorrenthalpy: 0.447827 hartree
zpe.thermalcorrgfe: 0.360011 hartree
zpe.sumelectzpe: -1373.266676 hartree
zpe.sumelectthermal: -1373.239956 hartree
zpe.sumelectthermalent: -1373.239012 hartree
zpe.sumelectthermalfe: -1373.326827 hartree
dipole: 0.2951 -0.0965 2.2205
dipole: 2.2421
quadrupole: -145.5686 -166.0213 -164.8167
quadrupole: -0.9021 14.6251 -13.5598
quadrupole: 13.2336 -7.2191 -6.0146 -0.9021 14.6251 -13.5598
hfenergy: -1373.6868386 hartree
pointgroup: C01[X(C21H24N2O6)]
dipole: 0.0640889 0.3001821 0.8269673 debye
polarizability: 321.579705|-4.9790301|259.4960453|32.347341|-37.6262269|235.7912984 unknown
InChI: InChI=1S/C21H24N2O6/c1-26-18-10-15(11-19(27-2)20(18)24)21(25)23-7-5-22(6-8-23)12-14-3-4-16-17(9-14)29-13-28-16/h3-4,9-11,24H,5-8,12-13H2,1-2H3
charge 0 multiplicity 1
53 atoms
O  2.672017 -2.926255 -0.000608
O  -5.821315 1.229738 -2.025591
O  -7.111173 2.058965 -0.173343
O  3.681563 2.689134 -1.762542
O  5.976834 0.638178 1.984763
O  5.744977 2.691137 0.358294
N  -1.961436 -1.802843 0.075543
N  0.840179 -1.6124 -0.591347
C  -1.120338 -3.024178 0.023128
C  -1.158654 -0.637914 0.515768
C  0.055002 -2.814564 -0.949997
C  0.019609 -0.388774 -0.450729
C  -3.195707 -1.990115 0.875915
C  -4.223082 -0.883957 0.654607
C  2.171815 -1.767587 -0.202688
C  3.038409 -0.542636 -0.063285
C  -4.447698 -0.389961 -0.66505
C  -4.981462 -0.38397 1.740398
C  -5.43324 0.582699 -0.823233
C  -6.19199 1.070508 0.263185
C  -5.988902 0.606636 1.563585
C  4.049353 -0.580813 0.933639
C  2.972967 0.552005 -0.95442
C  3.878753 1.636987 -0.856851
C  4.935753 0.498876 1.039772
C  -6.935132 2.139897 -1.64877
C  4.857183 1.623948 0.168282
C  4.870442 3.344338 -2.350184
C  6.178451 -0.457256 2.936146
H  -0.714208 -3.293063 1.030803
H  -1.739594 -3.869427 -0.331351
H  -1.805792 0.257136 0.530713
H  -0.756379 -0.7887 1.550896
H  -0.345192 -2.678988 -1.974153
H  0.737149 -3.679261 -0.926778
H  0.638978 0.435224 -0.067481
H  -0.385963 -0.09854 -1.440577
H  -3.630008 -2.962941 0.567493
H  -2.979328 -2.07265 1.971532
H  -3.846939 -0.761867 -1.498911
H  -4.789905 -0.767886 2.748983
H  -6.570975 0.992483 2.404156
H  4.124194 -1.468008 1.567336
H  2.249079 0.579119 -1.773728
H  -6.66234 3.173479 -1.920795
H  -7.862648 1.796193 -2.140639
H  6.329446 2.455665 1.130028
H  5.472006 3.846144 -1.576376
H  5.492931 2.601978 -2.885591
H  4.459973 4.074075 -3.064415
H  7.028012 -0.149589 3.563054
H  5.27894 -0.602754 3.563583
H  6.42019 -1.397547 2.406329
