program: Gaussian 09
title: 000197680
version: EM64L-G09RevD.01
frameworkgroup: C1[X(C16H22N2O12)]
method: RPBEPBE
basis: SDD
operation: Freq
keyword: #p
keyword: freq=noraman
keyword: PBEPBE/SDD
title: #p freq=noraman PBEPBE/SDD
converged: YES YES NO NO
title: Mulliken charges:
elementType: O O O O O O O O O O O O N N C C C C C C C C C C C C C C C C H H H H H H H H H H H H H H H H H H H H H H
charge: -0.456030 -0.458848 -0.306886 -0.459264 -0.246769 -0.173217 -0.438425 -0.474020 -0.207542 -0.188758 -0.404034 -0.251808 -0.190197 -0.379581 0.160477 -0.488966 -0.146555 -0.550150 0.268658 -0.148221 0.176644 -0.442716 0.223910 -0.430260 0.156188 -0.701526 -0.540150 0.145882 0.097468 0.194073 0.273041 0.260709 0.235335 0.266413 0.280578 0.258028 0.269658 0.272207 0.233143 0.254546 0.271904 0.253983 0.210216 0.352560 0.309890 0.270710 0.396057 0.384695 0.412654 0.380508 0.431091 0.382698
chargesum: 0.00000
title: Mulliken charges with hydrogens summed into heavy atoms:
elementType: O O O O O O O O O O O O N N C C C C C C C C C C C C C C C C
charge: -0.059973 -0.074153 -0.306886 -0.046610 -0.246769 -0.173217 -0.057917 -0.042929 -0.207542 -0.188758 -0.021336 -0.251808 -0.190197 -0.027020 0.160477 0.044784 0.088779 -0.003159 0.268658 0.109807 0.176644 0.099149 0.223910 0.057428 0.156188 0.034576 0.040450 0.145882 0.097468 0.194073
polarizability: 2.44019510e+02 -6.34088914e+00 2.13327578e+02 4.34281476e+00 3.12393278e+00 2.06881986e+02
1716.lowfreq: -1.8451 -0.0005 -0.0001 0.0004 6.9869 8.2875 19.5781 24.0407 26.7821
frequency: 19.1719 23.7602 26.7705 34.2498 37.6785 45.0573 53.5364 62.1390 73.5793 78.0321 87.5711 89.3921 101.8293 108.9269 115.5318 138.7767 145.9996 160.3972 177.3558 194.0072 200.1305 217.0134 222.8476 238.3225 260.8527 263.9433 270.2086 279.3462 304.5517 331.4166 332.5045 340.7738 344.6606 370.1365 391.4096 401.7804 421.4113 451.5927 457.3829 466.3809 470.1114 485.5732 495.7171 505.6914 520.0513 538.5744 545.6466 565.3706 585.2892 594.6329 605.6075 610.8031 625.4391 633.7892 648.9739 656.3474 671.3071 677.3058 704.2437 731.7563 740.5646 755.4228 769.8799 790.4615 798.1882 821.1933 826.1396 870.5425 876.7704 896.2157 901.2738 919.5188 934.0937 952.8665 994.8892 999.2504 1024.1199 1032.9221 1034.4151 1038.7402 1050.8508 1058.0994 1060.0856 1071.1642 1076.1233 1100.6293 1106.1404 1114.0562 1121.1379 1131.0328 1161.5481 1175.3700 1200.6965 1219.7645 1225.6386 1235.8319 1241.1392 1255.9491 1260.1702 1265.8853 1269.6370 1287.7908 1293.6852 1299.2039 1310.5226 1324.6440 1329.0950 1346.9455 1347.4585 1357.5210 1362.0612 1371.6776 1387.3368 1394.2743 1414.6506 1452.1623 1455.0632 1456.8164 1459.1717 1464.1063 1485.7463 1513.7559 1613.3830 1627.7709 1642.0715 1664.1833 1665.6905 1688.1247 2986.4449 3009.1402 3012.2055 3014.8762 3026.8971 3027.1015 3035.7895 3048.8534 3078.9334 3079.7386 3093.7702 3095.4160 3097.9001 3110.5291 3124.5952 3131.5854 3423.9172 3468.4462 3502.4891 3505.3226 3507.3430 3536.0413
redmass: 7.3871 8.4277 7.4597 7.5508 9.7869 6.6936 10.6094 8.1117 6.3557 6.2819 6.0912 7.7759 5.3045 7.0507 3.2046 4.3466 4.5711 6.3044 3.9709 1.4365 3.1441 5.4198 4.8837 3.7373 4.1579 5.4995 4.6240 4.4589 3.5792 6.8150 4.3892 3.4563 3.8253 6.0417 2.5909 4.1160 2.4739 4.1129 2.2712 1.3548 2.3587 2.2720 3.1822 4.6099 3.2476 4.1355 3.4745 3.4208 1.6672 3.7934 3.6204 3.3606 3.6171 1.8091 3.9048 1.7197 3.2097 3.6075 5.1462 1.8464 3.6317 1.8320 2.6600 1.9865 3.1164 2.1980 1.5430 4.0780 2.9406 4.9542 3.2553 2.5583 2.7942 2.2430 2.9812 2.9686 2.6511 3.2208 2.7414 2.7743 1.9557 2.8476 2.2114 2.2304 2.3444 3.0481 2.9709 2.5793 2.7564 2.9262 3.7331 1.3602 1.3076 1.3622 1.3791 2.0789 1.5355 1.3734 1.9589 1.4708 1.6478 1.5241 1.7432 1.3197 1.6330 1.6057 1.6175 1.5260 1.6962 1.3455 1.5559 1.3953 1.6517 1.5046 1.1004 1.0888 1.0950 1.0592 1.0854 1.0927 1.0546 1.6088 9.3113 6.8532 7.8803 9.3220 9.1423 10.4058 1.0822 1.0371 1.0720 1.0698 1.0624 1.0619 1.0626 1.0624 1.1019 1.0713 1.0998 1.0972 1.1018 1.0995 1.1046 1.1004 1.0807 1.0649 1.0638 1.0638 1.0655 1.0651
irintensity: 0.6062 5.2174 0.3213 0.2379 1.8391 2.8000 0.7411 2.5368 0.9553 2.4638 1.1728 0.4097 1.9776 2.4004 1.8431 0.6357 9.8113 3.1750 7.7705 5.5080 14.6917 12.2116 7.8524 6.6895 7.2108 8.5311 19.8779 7.2765 19.3591 3.1276 12.3146 8.7964 11.7873 11.7325 49.8586 16.8489 22.9746 10.6290 13.6459 166.0900 102.8816 16.3882 2.0021 44.8347 7.0070 1.4421 69.3135 26.2536 34.0980 61.4915 35.8191 29.0488 96.6190 37.3266 48.6433 85.0970 41.2140 85.1919 30.2046 86.6651 33.0859 24.3954 23.1068 159.8789 39.5802 128.4992 190.8999 9.6720 7.3334 45.8446 15.3699 52.9878 46.1134 14.5802 131.0348 21.8131 53.2527 243.0959 200.9880 54.4575 69.6860 36.2760 18.4748 85.2867 231.3019 147.2444 15.6469 25.2199 32.0779 25.2992 38.4814 6.3158 26.3742 7.8681 29.3383 76.3335 5.9345 26.1411 57.1253 20.7607 30.3969 33.1393 26.5995 11.2247 55.8683 18.9821 55.0029 18.1505 73.9840 13.2132 87.3614 33.5669 78.6868 43.0070 47.2767 2.2804 36.8496 13.2458 12.3221 19.2649 8.5331 177.1447 297.3320 262.5325 86.9281 156.7955 298.6497 160.2726 8.9380 23.6010 13.4808 19.0255 15.2171 8.7697 4.5288 9.4485 16.9403 981.9858 6.6673 3.3308 4.5759 13.6463 4.2429 3.7385 153.0145 88.7660 25.1774 24.0073 74.8751 72.1011
temp: 298.150 k
press: 1.00000 atm
elementType: 8 8 8 8 8 8 8 8 8 8 8 8 7 7 6 6 6 6 6 6 6 6 6 6 6 6 6 6 6 6 1 1 1 1 1 1 1 1 1 1 1 1 1 1 1 1 1 1 1 1 1 1
symmnumber: 1
zpe: 1025937.3 jmol-1
zpe.correction: 0.390759 hartree
zpe.thermalcorrener: 0.421862 hartree
zpe.thermalcorrenthalpy: 0.422806 hartree
zpe.thermalcorrgfe: 0.326186 hartree
zpe.sumelectzpe: -1632.856301 hartree
zpe.sumelectthermal: -1632.825198 hartree
zpe.sumelectthermalent: -1632.824254 hartree
zpe.sumelectthermalfe: -1632.920874 hartree
dipole: -6.9508 -3.1006 -9.2533
dipole: 11.9813
quadrupole: -147.7687 -177.5750 -184.6314
quadrupole: -18.7116 0.4618 -4.4882
quadrupole: 22.2230 -7.5833 -14.6397 -18.7116 0.4618 -4.4882
hfenergy: -1633.2470598 hartree
pointgroup: C01 [X(C16H22N2O12)]
dipole: 2.7134528 -2.552041 2.8886526 debye
polarizability: 244.2466057|3.727741|214.4588465|6.1322288|-0.1090384|205.5236227 unknown
InChI: InChI=1S/C16H22N2O12/c1-7(18-9(19)2-4-16(18,30)14(27)28)11(22)17-5-3-8(12(23)24)15(29,13(25)26)6-10(20)21/h7-8,17,20,23,25,27,29-30H,2-6H2,1H3
charge 0 multiplicity 1
52 atoms
O  2.718275 -0.455642 1.924802
O  -4.088893 1.265448 -0.188126
O  1.106064 -0.788451 -2.113633
O  5.272651 -0.113178 1.721648
O  1.721113 2.942268 -1.343039
O  5.605449 -1.678389 0.027389
O  -2.845859 0.135802 3.063035
O  -1.323242 -0.942234 -1.193305
O  -2.677639 2.421213 2.763424
O  -2.603323 0.528827 -2.4763
O  -4.995552 -2.963399 -0.102664
O  -5.367672 -0.995703 -1.263543
N  2.76762 -0.45088 -0.484811
N  1.133834 1.672858 0.52238
C  3.285731 -1.103189 0.732522
C  2.774681 -2.570033 0.622661
C  3.098044 0.957007 -0.842618
C  1.588947 -2.508958 -0.364429
C  1.773095 -1.192141 -1.112467
C  -1.972578 0.908856 0.916691
C  -3.052551 0.264378 -0.032728
C  -1.337148 2.17107 0.279658
C  1.897622 1.935932 -0.595657
C  0.020844 2.568897 0.904624
C  4.834798 -1.032559 0.753527
C  3.638445 1.08028 -2.27824
C  -3.631388 -1.07775 0.505513
C  -2.53877 1.275945 2.289355
C  -2.333387 -0.012694 -1.388433
C  -4.727689 -1.623225 -0.384143
H  3.579887 -3.208284 0.224909
H  2.494267 -2.924485 1.625355
H  3.889121 1.27219 -0.131524
H  1.567579 -3.350952 -1.074641
H  0.606859 -2.475707 0.140929
H  -1.205287 0.126305 1.07643
H  -2.045273 3.009263 0.391241
H  -1.184818 2.02912 -0.803542
H  -0.046781 2.600295 2.007393
H  0.283016 3.580803 0.54966
H  2.886316 0.735937 -3.003964
H  3.852328 2.13983 -2.490718
H  4.561058 0.484682 -2.39356
H  1.389587 0.877124 1.121954
H  -4.056475 -0.9153 1.511888
H  -2.840185 -1.837458 0.613568
H  3.434394 0.048151 2.396603
H  -4.699579 0.9642 -0.916712
H  6.264717 -0.051871 1.741726
H  -3.191638 0.437645 3.947492
H  -0.592684 -0.945847 -1.90328
H  -5.740234 -3.278895 -0.6848
