program: Gaussian 09
title: 000201703
version: EM64L-G09RevD.01
frameworkgroup: C1[X(C22H29NO)]
method: RPBEPBE
basis: SDD
operation: Freq
keyword: #p
keyword: freq=noraman
keyword: PBEPBE/SDD
title: #p freq=noraman PBEPBE/SDD
converged: YES YES NO NO
title: Mulliken charges:
elementType: O N C C C C C C C C C C C C C C C C C C C C C C H H H H H H H H H H H H H H H H H H H H H H H H H H H H H
charge: -0.441680 -0.077415 0.300012 -0.484178 -0.536505 -0.418436 -0.432921 -0.360153 0.455902 -0.346403 -0.389629 -0.503822 -0.439814 -0.582048 -0.702307 0.255030 -0.214918 0.500774 -0.416805 -0.412861 -0.414989 -0.230148 -0.228991 -0.243988 0.214070 0.218304 0.186473 0.220453 0.227625 0.183129 0.216670 0.194080 0.207616 0.172854 0.191543 0.220273 0.220439 0.201135 0.249263 0.246370 0.211025 0.220912 0.210262 0.209082 0.214383 0.220816 0.219101 0.231234 0.233617 0.352924 0.222833 0.223135 0.226672
chargesum: 0.00000
title: Mulliken charges with hydrogens summed into heavy atoms:
elementType: O N C C C C C C C C C C C C C C C C C C C C C C
charge: -0.088756 -0.077415 0.300012 -0.051804 -0.129579 -0.007681 -0.022171 0.020317 0.455902 0.065414 0.031944 -0.254559 -0.193444 -0.150111 -0.068580 0.255030 0.005898 0.500774 -0.197704 -0.181628 -0.181371 -0.007315 -0.005856 -0.017316
polarizability: 3.17898566e+02 2.90026470e+00 2.11400264e+02 1.15422952e+01 8.60701548e+00 2.02599739e+02
1716.lowfreq: -19.4748 -5.7611 -4.7660 -0.0006 0.0001 0.0004 16.6473 18.2040 26.4926
frequency: 15.5861 16.6630 26.4493 31.2325 48.1254 49.3233 58.7811 87.0501 97.3149 122.6439 152.8570 179.0707 196.5902 215.2018 224.3108 229.6414 257.0047 274.3317 285.4996 296.9255 310.8687 337.7321 353.6548 353.7847 400.8172 403.9424 407.5113 432.7626 457.6860 481.9376 487.4277 508.5415 515.3762 527.1135 589.0685 615.6878 617.9648 635.5816 692.2657 705.4549 709.0724 737.5977 755.3779 770.8332 777.0304 790.7506 821.3741 830.0684 854.0588 857.7326 859.0203 863.9084 878.8411 887.1452 912.3843 917.5684 922.0850 945.9245 956.9644 975.5652 985.6191 989.9807 992.3139 997.7534 1009.1746 1017.3832 1026.2627 1032.0384 1040.1358 1057.6477 1079.8380 1085.2166 1096.2799 1107.2051 1109.5649 1126.1363 1144.8614 1151.5417 1165.2319 1171.5119 1179.1371 1185.8817 1186.4080 1197.9904 1201.5617 1216.5704 1239.0104 1245.2201 1266.1320 1281.1180 1286.2417 1291.3573 1291.7043 1304.5382 1306.0695 1312.5429 1323.8437 1326.0825 1345.6849 1348.1873 1351.6155 1365.6087 1382.0784 1382.8447 1385.0463 1389.8185 1439.5483 1451.4690 1456.7079 1459.5374 1463.3640 1463.7380 1470.5057 1472.8284 1474.6759 1475.7876 1481.1064 1483.9698 1484.1973 1489.4190 1587.3475 1592.4611 1614.1509 1626.3018 2815.5132 2829.2471 2854.3965 2966.9106 2968.7049 2970.3884 2978.1834 2993.1726 2994.1415 3016.8809 3020.5127 3028.1964 3033.9502 3039.8215 3047.0502 3056.0771 3060.1345 3068.2080 3068.7316 3113.1847 3113.8542 3115.1280 3130.6020 3140.5457 3142.2066 3151.5233 3161.0388 3170.3480 3582.6939
redmass: 3.9110 4.1298 4.5943 4.6423 2.6624 1.9669 3.5469 4.3795 3.1462 2.9999 3.5018 3.7434 3.1377 2.5484 1.9720 1.7649 3.7653 2.9604 3.1447 2.3732 2.4685 2.5648 1.5311 1.6634 2.4197 2.7992 3.3286 2.7481 3.4881 3.3964 3.2971 2.2982 4.1372 4.3521 4.7169 3.8546 6.3608 3.7228 2.2126 1.8161 2.0934 1.3144 1.9101 2.2678 1.8040 1.3252 3.0454 2.6556 1.2482 1.5581 1.8307 1.4684 1.6212 1.8581 2.2880 1.6224 1.9060 1.9964 1.3258 1.3855 6.0748 6.1977 1.3516 2.6864 1.6872 1.7256 2.2487 2.5708 2.4581 2.4857 2.0288 1.6747 1.7620 1.7776 1.8447 2.4793 1.5523 1.7307 2.0002 1.0579 1.6253 1.2168 1.1155 1.4421 1.7054 2.3367 1.4877 1.8474 1.7558 1.3125 1.2610 1.4369 1.3102 1.2745 1.3188 1.3343 1.3156 1.2628 1.4312 1.4756 1.3935 1.4230 7.5501 4.9485 1.2441 1.4601 2.1800 1.2085 1.1243 2.0555 1.1061 1.0951 1.0683 1.1301 1.1254 1.2351 1.5628 1.4982 1.3645 1.1492 6.1732 6.0523 6.1761 6.3164 1.0718 1.0700 1.0699 1.0533 1.0518 1.0542 1.0609 1.0619 1.0618 1.0872 1.0962 1.0872 1.0975 1.0881 1.0995 1.1010 1.1023 1.1006 1.0998 1.0868 1.0880 1.0868 1.0908 1.0927 1.0959 1.0910 1.1015 1.0950 1.0660
irintensity: 0.0478 0.0051 0.0339 0.3280 0.0044 0.0012 0.5658 0.3830 0.5310 0.6869 0.7133 1.1356 3.2835 0.8077 0.4498 0.7659 2.0714 0.4522 1.2659 2.6484 1.0419 0.7774 76.9337 59.6741 0.9205 0.0660 11.5919 2.6095 2.5773 1.7514 2.5104 5.6335 10.7295 8.3042 4.6425 2.0798 0.0671 0.6911 14.6816 52.6872 22.2658 13.8815 31.8608 16.6327 43.5598 3.4451 7.8745 8.7691 0.0058 12.3107 11.7424 4.8895 22.8754 9.7408 7.6783 4.0864 2.4229 23.3042 0.1094 0.1235 0.2514 0.1881 1.1984 27.0314 4.3318 4.3521 5.2936 12.3189 6.4003 3.6819 30.4951 19.0487 14.0029 27.8565 23.0586 13.6281 133.5871 23.6875 2.0324 0.2970 35.9553 25.7143 0.6621 10.2853 1.5960 0.2697 5.0134 19.2486 13.8924 3.1740 2.9855 4.1124 12.2675 32.5981 10.4083 12.7949 5.9547 0.9592 3.8717 1.8364 8.9229 2.0848 1.3825 20.8294 10.8499 3.3272 6.6130 5.5209 9.1498 13.5387 1.5692 6.1593 0.6502 17.0863 24.5590 3.1731 24.7192 14.0058 18.9720 23.6085 60.3676 1.5649 13.7145 76.6368 64.9827 87.5855 136.2237 4.5000 60.6235 13.5819 43.1425 56.0494 9.5418 5.5726 3.5946 49.6193 26.0334 46.3385 12.3588 58.1103 29.8081 75.4795 67.9923 10.5989 13.3519 6.7342 12.2889 26.1779 46.1809 5.8828 26.2292 11.6852 33.9655
temp: 298.150 k
press: 1.00000 atm
elementType: 8 7 6 6 6 6 6 6 6 6 6 6 6 6 6 6 6 6 6 6 6 6 6 6 1 1 1 1 1 1 1 1 1 1 1 1 1 1 1 1 1 1 1 1 1 1 1 1 1 1 1 1 1
symmnumber: 1
zpe: 1198176.9 jmol-1
zpe.correction: 0.456361 hartree
zpe.thermalcorrener: 0.479838 hartree
zpe.thermalcorrenthalpy: 0.480782 hartree
zpe.thermalcorrgfe: 0.400285 hartree
zpe.sumelectzpe: -983.902990 hartree
zpe.sumelectthermal: -983.879514 hartree
zpe.sumelectthermalent: -983.878569 hartree
zpe.sumelectthermalfe: -983.959067 hartree
dipole: 0.4389 -0.0888 -1.6475
dipole: 1.7073
quadrupole: -134.6086 -140.3060 -144.3373
quadrupole: -4.9963 -5.3617 2.6214
quadrupole: 5.1420 -0.5554 -4.5866 -4.9963 -5.3617 2.6214
hfenergy: -984.3593512 hartree
pointgroup: C01 [X(C22H29N1O1)]
dipole: 0.1713553 0.6487562 -0.0307357 debye
polarizability: 317.9125512|-11.2297554|202.6295366|3.5307104|-8.7129143|211.3564819 unknown
InChI: InChI=1S/C22H29NO/c1-2-13-22(20-10-6-11-21(24)17-20)14-7-15-23(18-22)16-12-19-8-4-3-5-9-19/h3-6,8-11,17,24H,2,7,12-16,18H2,1H3
charge 0 multiplicity 1
53 atoms
O  6.648851 0.085199 0.037564
N  -0.751802 -0.349886 0.849089
C  1.746283 -0.360453 0.518394
C  1.894727 -0.608848 2.059977
C  0.406142 0.405876 0.311881
C  1.710326 -1.730131 -0.242623
C  0.650259 -1.284077 2.67817
C  -0.634862 -0.514045 2.318983
C  2.953747 0.472643 0.032271
C  -2.048969 0.229078 0.428376
C  1.63296 -1.642778 -1.783994
C  4.261863 -0.038136 0.229056
C  2.819919 1.730225 -0.617414
C  -3.22592 -0.779022 0.54342
C  1.692138 -3.039331 -2.440914
C  5.394309 0.680622 -0.204808
C  3.958608 2.446251 -1.049524
C  -4.516229 -0.194478 -0.010501
C  5.257482 1.933539 -0.849002
C  -5.37294 0.586845 0.808065
C  -4.869345 -0.377409 -1.372947
C  -6.548777 1.168899 0.282589
C  -6.044055 0.201716 -1.903944
C  -6.888466 0.978827 -1.077123
H  2.062055 0.37105 2.552761
H  2.793298 -1.222031 2.260593
H  0.488418 1.410952 0.804502
H  0.22867 0.580588 -0.764883
H  0.834212 -2.299608 0.117868
H  2.615263 -2.309236 0.034809
H  0.558745 -2.325589 2.319312
H  0.757356 -1.324909 3.779547
H  -1.517374 -1.061193 2.695127
H  -0.621602 0.488101 2.827664
H  -2.303673 1.154748 1.00662
H  -1.960411 0.532012 -0.632267
H  2.461001 -1.016861 -2.169099
H  0.689956 -1.143876 -2.083901
H  4.429347 -1.004045 0.715879
H  1.831743 2.162145 -0.795187
H  -3.36888 -1.064353 1.60266
H  -2.93672 -1.692997 -0.007053
H  2.643085 -3.550602 -2.198182
H  0.865391 -3.682201 -2.083096
H  1.616862 -2.972172 -3.542098
H  3.834024 3.41339 -1.549632
H  6.139775 2.493065 -1.186332
H  -5.119715 0.732491 1.866051
H  -4.221641 -0.984732 -2.018034
H  7.379684 0.659612 -0.300777
H  -7.20048 1.765606 0.931317
H  -6.303115 0.043984 -2.957297
H  -7.801622 1.426238 -1.485716
