program: Gaussian 09
title: 000201712
version: EM64L-G09RevD.01
frameworkgroup: C1[X(C21H22N2O6)]
method: RPBEPBE
basis: SDD
operation: Freq
keyword: #p
keyword: freq=noraman
keyword: PBEPBE/SDD
title: #p freq=noraman PBEPBE/SDD
converged: NO YES NO NO
title: Mulliken charges:
elementType: O O O O O O N N C C C C C C C C C C C C C C C C C C C C C H H H H H H H H H H H H H H H H H H H H H H
charge: -0.248219 -0.395390 -0.355502 -0.281547 -0.290118 -0.267165 -0.415321 -0.450042 -0.237045 -0.458627 -0.496907 0.174009 0.220511 0.475674 0.229800 0.256177 -0.449221 -0.344957 0.244010 -0.335006 -0.339062 -0.342014 -0.352175 -0.224635 -0.248631 0.176493 -0.224680 -0.256721 -0.666461 0.282097 0.259947 0.249804 0.262948 0.265667 0.365928 0.373295 0.248403 0.303837 0.268217 0.268408 0.276692 0.248838 0.234145 0.231356 0.385571 0.233969 0.219356 0.233137 0.214051 0.225724 0.251383
chargesum: 0.00000
title: Mulliken charges with hydrogens summed into heavy atoms:
elementType: O O O O O O N N C C C C C C C C C C C C C C C C C C C C C
charge: -0.248219 -0.009820 -0.355502 -0.281547 -0.290118 -0.267165 -0.049393 -0.076747 0.045052 0.051124 0.031708 0.174009 0.220511 0.475674 0.229800 0.256177 -0.200817 -0.041120 0.244010 -0.066789 -0.070654 -0.065321 -0.103337 0.009509 -0.017275 0.176493 0.009289 0.195771 0.024697
polarizability: 4.00919535e+02 4.73288966e+00 2.80970825e+02 -1.42467885e+01 -1.77058101e+01 1.73064917e+02
1716.lowfreq: -4.7811 -0.0013 -0.0006 0.0001 2.2537 4.7209 15.5150 20.4097 23.5196
frequency: 15.4813 20.4044 23.4989 27.8204 38.7118 45.7140 56.2484 61.9322 75.7554 78.3395 92.6012 95.0035 113.9056 120.9326 142.0600 150.3953 163.2665 185.1431 189.2040 223.2134 242.1234 249.2033 285.7561 294.7846 305.8742 315.1070 327.2501 374.4319 393.8972 400.3374 408.1088 414.2541 441.7221 451.3740 463.8212 480.9836 484.0596 513.1838 523.9732 589.2947 614.6488 622.6022 631.1503 644.6887 660.5259 678.9545 682.3770 683.3387 695.9762 722.1738 738.9850 761.2925 772.8026 781.9611 797.0546 814.0202 821.3200 832.0902 845.5603 849.0628 862.4849 876.4116 879.8634 917.0115 941.4784 947.9626 959.1117 988.9684 989.4812 992.2539 998.1673 1005.3604 1009.5891 1012.0932 1026.0206 1049.0028 1057.5998 1060.7798 1078.9299 1088.4913 1095.7214 1107.4926 1121.7871 1146.2306 1154.4988 1169.2665 1174.0954 1183.8131 1199.8588 1205.3140 1238.5901 1252.1830 1267.2546 1279.3779 1284.4942 1288.3714 1303.7262 1310.0251 1327.0051 1342.7907 1356.9070 1357.5624 1375.6873 1377.8386 1386.9338 1389.1786 1426.4743 1430.1024 1433.0942 1455.6152 1456.7008 1462.6439 1477.7034 1484.5687 1504.6610 1514.3952 1534.3850 1546.1166 1592.8448 1598.1849 1612.7088 1614.4795 1625.0527 1639.3086 1647.0640 2975.7383 2990.2464 2991.5509 3026.7544 3028.9487 3062.9553 3086.2279 3087.0811 3090.8767 3116.6995 3122.0784 3129.4936 3132.7315 3138.2769 3149.4651 3161.3305 3163.2099 3170.5923 3172.1092 3196.4024 3416.2878 3511.6137
redmass: 5.7879 5.6112 4.6161 4.1480 5.1747 4.0853 4.3686 5.1381 5.4822 6.3311 6.0989 5.4292 5.5138 3.5452 6.3654 6.1884 4.9758 5.6540 3.0951 1.5138 3.3956 4.0368 7.3473 4.3592 5.3252 5.1033 4.0954 6.6310 5.1964 2.8099 4.1035 3.0134 3.0228 3.2709 3.7456 5.0915 5.0504 2.8664 3.0985 3.4947 6.4330 4.3361 6.3476 3.8062 1.7525 4.2556 3.6536 4.3526 1.5725 1.3616 3.2484 4.5041 3.1258 3.7756 2.4696 1.6520 3.1843 4.0609 3.0798 1.5333 1.2656 2.9483 1.6053 2.4932 3.4094 1.4204 1.2357 1.5647 3.5217 1.4079 3.3511 1.3365 1.3352 2.6991 2.4533 3.3491 3.0371 3.5548 2.5477 1.5929 2.1538 2.0450 1.3402 2.8376 1.6731 2.1497 1.0627 1.1644 1.2009 1.7212 1.3257 3.0616 1.6078 1.1160 1.6835 1.6571 1.6671 1.5261 1.3192 1.6122 1.6316 1.3094 2.3234 3.3006 8.1794 1.2334 4.2637 1.1161 2.2260 1.1030 1.1043 1.0436 2.0145 1.0530 2.7095 4.1051 2.4131 3.1577 5.0662 5.7736 5.7355 8.8862 5.6382 6.7720 2.3586 1.0832 1.0663 1.0361 1.0592 1.0630 1.0933 1.0976 1.1007 1.1034 1.1055 1.0864 1.0852 1.0895 1.0887 1.0933 1.0962 1.0955 1.0903 1.1002 1.0957 1.0810 1.0641
irintensity: 0.7001 0.2573 0.3089 0.0947 0.8824 0.2174 0.9664 1.8256 2.1213 6.0820 2.3642 2.2373 9.0170 0.8432 3.5766 0.7089 4.5192 0.7055 15.2757 1.1807 5.2599 12.6783 3.9434 6.0718 2.9201 15.4708 2.7271 19.2459 3.4010 0.2688 6.1121 0.0977 24.3453 4.9904 16.0899 4.2640 5.8694 46.9959 13.2068 26.0440 0.1759 4.7964 1.2697 9.7975 133.2337 22.9878 30.6278 15.5618 19.5001 278.7459 7.8072 10.4944 32.7046 11.3839 14.0554 2.1061 0.9301 18.3176 13.9082 8.5161 3.2455 4.7471 49.4454 4.5054 9.1938 12.9105 139.3980 11.0119 1.9159 1.2696 7.7522 0.6916 1.4089 43.9911 8.2729 35.4531 146.5207 394.0382 168.9951 14.7261 24.5563 53.8651 12.4678 17.8807 63.2096 2.4324 2.4884 105.5457 8.6596 48.9495 13.2784 397.5046 7.0905 1.7602 76.9297 24.1237 101.6933 31.2509 0.8678 77.4028 3.3026 16.9755 117.8131 1.6286 5.5748 25.0729 15.9586 47.8107 1.1788 42.4211 37.4411 15.5481 72.6986 18.8929 5.8764 328.8940 541.8471 228.0023 254.2292 53.6218 18.5759 235.4269 68.8186 223.9584 146.8125 9.4637 9.2867 27.1185 41.8673 5.2737 9.6536 44.9609 8.0523 2.2614 37.0662 719.6663 0.3165 21.2648 8.7521 12.1058 12.9518 6.3768 0.7654 20.2776 1.6175 262.6820 34.5310
temp: 298.150 k
press: 1.00000 atm
elementType: 8 8 8 8 8 8 7 7 6 6 6 6 6 6 6 6 6 6 6 6 6 6 6 6 6 6 6 6 6 1 1 1 1 1 1 1 1 1 1 1 1 1 1 1 1 1 1 1 1 1 1
symmnumber: 1
zpe: 1046395.1 jmol-1
zpe.correction: 0.398551 hartree
zpe.thermalcorrener: 0.426150 hartree
zpe.thermalcorrenthalpy: 0.427094 hartree
zpe.thermalcorrgfe: 0.336013 hartree
zpe.sumelectzpe: -1372.248738 hartree
zpe.sumelectthermal: -1372.221139 hartree
zpe.sumelectthermalent: -1372.220195 hartree
zpe.sumelectthermalfe: -1372.311276 hartree
dipole: -6.8298 -1.3670 0.3878
dipole: 6.9760
quadrupole: -129.6231 -160.4076 -171.3889
quadrupole: -4.9220 1.5811 5.4999
quadrupole: 24.1834 -6.6010 -17.5824 -4.9220 1.5811 5.4999
hfenergy: -1372.6472893 hartree
pointgroup: C01 [X(C21H22N2O6)]
dipole: -2.6030919 0.8325245 -0.2520572 debye
polarizability: 398.4200822|-21.1035096|260.787977|2.6401332|-48.6811893|195.7472179 unknown
InChI: InChI=1S/C21H22N2O6/c1-2-29-21(28)15-8-10-16(11-9-15)22-20(27)17(12-13-18(24)25)23-19(26)14-6-4-3-5-7-14/h3-11,17,22-24H,2,12-13H2,1H3
charge 0 multiplicity 1
51 atoms
O  0.286708 2.129514 -1.619598
O  -5.939826 3.573735 -0.93278
O  -1.593397 -0.334382 1.703481
O  -4.737136 1.729672 -1.628805
O  6.52409 -1.100205 -1.248408
O  6.219396 -2.40612 0.664963
N  -2.50958 0.682978 -0.161894
N  0.504007 0.674478 0.227434
C  -1.624807 1.865614 -0.056315
C  -2.207715 3.070912 -0.821811
C  -3.605002 3.539015 -0.352886
C  -0.17685 1.570224 -0.580936
C  -2.486184 -0.326366 0.772232
C  1.814594 0.163649 0.066254
C  -4.765265 2.836815 -1.031561
C  -3.51394 -1.416985 0.679677
C  2.25558 -0.794394 1.024991
C  2.689284 0.561093 -0.984476
C  4.421174 -0.950382 -0.108776
C  3.54302 -1.34248 0.937021
C  3.978333 0.00282 -1.062071
C  -3.376931 -2.506443 1.579008
C  -4.593889 -1.409025 -0.244793
C  -4.296049 -3.574373 1.554782
C  -5.511343 -2.481574 -0.266992
C  5.77421 -1.562677 -0.156993
C  -5.365785 -3.566513 0.628891
C  7.908927 -1.642154 -1.373501
C  8.89334 -0.816879 -0.538893
H  -1.536387 2.102103 1.024593
H  -2.211745 2.84907 -1.903712
H  -1.495546 3.904038 -0.695681
H  -3.728638 3.399221 0.740584
H  -3.73383 4.621538 -0.530109
H  -3.209137 0.704559 -0.916145
H  -0.071423 0.282484 1.008288
H  1.578613 -1.101649 1.830687
H  2.346109 1.292726 -1.717727
H  3.892842 -2.079302 1.667213
H  4.655938 0.301239 -1.866728
H  -2.541524 -2.487146 2.285894
H  -4.74426 -0.578187 -0.943025
H  -4.179233 -4.411156 2.251754
H  -6.339944 -2.470152 -0.98336
H  -6.688852 3.081088 -1.367197
H  -6.079936 -4.397114 0.605247
H  8.120254 -1.570459 -2.452753
H  7.903979 -2.699214 -1.054044
H  9.923976 -1.180904 -0.708388
H  8.852224 0.249377 -0.821308
H  8.666761 -0.911526 0.536173
