program: Gaussian 09
title: 000201681
version: EM64L-G09RevD.01
frameworkgroup: C1[X(C19H18O2)]
method: RPBEPBE
basis: SDD
operation: Freq
keyword: #pfreq=noraman
keyword: PBEPBE/SDD
title: #p freq=noraman PBEPBE/SDD
converged: YES YES NO NO
title: Mulliken charges:
elementType: O O C C C C C C C C C C C C C C C C C C C H H H H H H H H H H H H H H H H H H
charge: -0.149186 -0.149181 -0.573377 0.409221 0.152749 0.097231 -0.033926 -0.034106 0.246341 0.246612 0.356416 0.370184 -0.723348 -0.895243 -0.894262 -0.384228 -0.384261 -0.860375 -0.855791 -0.209731 -0.209735 0.306488 0.230993 0.252338 0.257685 0.252425 0.243891 0.243827 0.259573 0.280125 0.280121 0.230623 0.233677 0.230631 0.230106 0.230103 0.233982 0.240705 0.240705
chargesum: 0.00000
title: Mulliken charges with hydrogens summed into heavy atoms:
elementType: O O C C C C C C C C C C C C C C C C C C C
charge: -0.149186 -0.149181 -0.266889 0.409221 0.152749 0.097231 -0.033926 -0.034106 0.246341 0.246612 0.356416 0.370184 -0.492355 -0.132795 -0.146972 -0.104103 -0.104141 -0.165444 -0.161601 0.030974 0.030971
polarizability: 2.95072164e+02 1.51305679e+01 1.75357825e+02 -2.47164345e-02 4.57709882e-02 1.67409496e+02
1716.lowfreq: -5.8071 -4.6774 -0.0005 0.0002 0.0004 7.3797 18.3454 35.2427 48.3858
frequency: 18.2496 35.2395 48.3723 97.9201 103.7413 122.9240 127.2428 143.9732 171.5050 179.0229 185.8544 198.4513 202.7761 224.5676 233.6392 300.6559 315.1897 329.9655 344.1856 352.1495 358.2170 392.6644 433.1815 436.1992 472.9965 503.9997 521.8701 525.3735 552.5566 565.6792 589.6912 600.9216 617.0670 673.0111 693.2067 721.1129 755.4429 760.7713 769.7535 799.8103 851.0884 851.6208 884.1141 904.5777 911.1903 964.6777 984.7587 998.6667 1005.4408 1013.1508 1021.5083 1021.8166 1031.0982 1034.4163 1040.9967 1051.0847 1055.9277 1079.2435 1080.2308 1119.7340 1170.7940 1170.9287 1189.7632 1210.0393 1231.9443 1248.2554 1256.4673 1278.5693 1314.2867 1358.9918 1391.6567 1393.1888 1399.9070 1401.2466 1404.4410 1407.0105 1450.4921 1453.0172 1454.5281 1462.8848 1469.3496 1471.5889 1487.1472 1492.0434 1497.7363 1498.1199 1502.3797 1583.0642 1590.3146 1598.5719 1613.9430 1627.7256 1655.8289 2968.0231 2970.7608 2971.5539 2978.2453 2978.8005 3039.5639 3046.2769 3047.2161 3050.1854 3078.1194 3078.7182 3104.4789 3106.3240 3115.8026 3136.4303 3149.6016 3160.6262 3170.9408
redmass: 3.9631 5.7071 4.1961 1.7822 2.2492 4.1924 7.4533 1.5599 1.1991 5.4675 1.9765 5.3146 1.1471 1.1603 6.6573 2.8966 3.5535 7.5025 2.9820 2.6550 3.1639 3.3788 4.6174 4.6428 4.1508 4.5246 7.4541 9.4325 4.3360 2.9845 3.2651 3.5666 6.7160 4.2080 5.4650 4.7378 3.6356 1.9217 3.9435 2.0527 5.1833 3.7043 1.3366 2.6304 1.4425 5.5139 1.4139 1.4003 2.3734 1.3568 1.5410 1.4201 1.5190 1.9991 2.3837 1.6155 1.7192 2.5249 2.3851 2.7135 1.1235 1.6248 1.5936 1.9634 3.2231 3.0268 1.5674 1.6004 8.0932 5.3791 1.3579 1.2271 1.3084 1.4155 2.7875 4.6151 2.4796 2.5011 1.6127 1.1624 1.0469 1.0468 1.0730 1.6754 1.1400 1.0474 1.0457 5.8895 7.6694 7.6964 6.7240 10.2710 12.4164 1.0455 1.0377 1.0376 1.0718 1.0407 1.0981 1.0976 1.0976 1.0972 1.0979 1.0982 1.0935 1.0924 1.0910 1.0863 1.0901 1.0955 1.1004
irintensity: 0.0383 3.2543 1.0958 0.9486 1.7459 0.0291 4.5153 0.9338 1.8862 0.1072 1.2780 1.1562 0.2034 0.0008 0.1289 0.2680 2.3241 6.3082 0.8183 0.5330 0.0010 0.0222 0.0067 0.4614 11.5994 5.3224 0.8986 0.3373 1.9005 2.3864 0.0000 0.5675 35.7831 3.9281 0.0305 12.1566 0.8254 56.6085 0.1627 25.9333 2.2243 4.5225 6.7321 27.7796 0.3078 8.7540 3.4851 7.4021 2.3411 0.0652 13.8083 0.2309 13.6102 3.3396 0.7142 0.0973 2.7044 1.4923 1.4132 13.5771 23.9832 0.1670 7.5091 6.9550 58.3680 213.4331 52.2452 2.3569 13.0202 3.7560 2.9129 2.7639 16.8017 11.5276 10.5651 1.5399 0.9234 0.1070 0.7223 1.6182 18.4649 35.4728 19.2609 31.7887 36.8010 4.1917 2.3264 1.3256 150.3505 2.3868 5.2894 147.2000 48.9102 42.4754 46.7491 29.8962 34.2088 26.1803 13.2763 17.0450 24.6914 9.7959 13.8390 33.8340 18.3212 22.2885 33.4206 1.6788 3.8341 5.3637 29.1283
temp: 298.150 k
press: 1.00000 atm
elementType: 8 8 6 6 6 6 6 6 6 6 6 6 6 6 6 6 6 6 6 6 6 1 1 1 1 1 1 1 1 1 1 1 1 1 1 1 1 1 1
symmnumber: 1
zpe: 821071.2 jmol-1
zpe.correction: 0.312730 hartree
zpe.thermalcorrener: 0.332224 hartree
zpe.thermalcorrenthalpy: 0.333168 hartree
zpe.thermalcorrgfe: 0.264599 hartree
zpe.sumelectzpe: -883.801977 hartree
zpe.sumelectthermal: -883.782483 hartree
zpe.sumelectthermalent: -883.781539 hartree
zpe.sumelectthermalfe: -883.850108 hartree
dipole: 2.8719 0.3080 0.0003
dipole: 2.8884
quadrupole: -93.0030 -115.1418 -137.2413
quadrupole: 2.9631 -0.0002 -0.0378
quadrupole: 22.1257 -0.0131 -22.1126 2.9631 -0.0002 -0.0378
hfenergy: -884.114707 hartree
pointgroup: C01 [X(C19H18O2)]
dipole: 1.1356111 0.0417833 0.0001684 debye
polarizability: 296.5985721|6.6235529|173.8312931|-0.0135213|0.0551239|167.4096191 unknown
InChI: InChI=1S/C19H18O2/c1-10-9-11(2)13(4)16(12(10)3)17-18(20)14-7-5-6-8-15(14)19(17)21/h5-9,17H,1-4H3
charge 0 multiplicity 1
39 atoms
O  0.719327 -0.482965 -2.428248
O  0.719094 -0.478855 2.428476
C  0.148235 -0.764099 0.000318
C  -1.225987 -0.103676 0.00031
C  -1.324652 1.321062 0.000504
C  -2.390364 -0.929357 0.000241
C  1.071758 -0.506727 -1.222933
C  1.071942 -0.506405 1.223365
C  2.467286 -0.337047 -0.709056
C  2.467334 -0.336372 0.709237
C  -2.613347 1.925476 0.00062
C  -3.676096 -0.315997 0.000364
C  -3.756964 1.094589 0.000543
C  -0.072057 2.1852 0.000714
C  -2.267747 -2.448561 0.000058
C  3.665433 -0.191842 -1.437813
C  3.665499 -0.190223 1.437776
C  -2.800262 3.43547 0.000848
C  -4.963844 -1.126737 0.000315
C  4.869466 -0.043259 -0.711663
C  4.869494 -0.04242 0.711404
H  0.000958 -1.864466 0.000564
H  -4.748615 1.564529 0.000646
H  0.554079 1.999395 -0.89206
H  -0.317046 3.257982 0.000942
H  0.55404 1.99901 0.893442
H  -1.728824 -2.815508 -0.89494
H  -1.729114 -2.815737 0.89514
H  -3.254583 -2.935285 -0.000176
H  3.650579 -0.194382 -2.532381
H  3.650723 -0.191753 2.532347
H  -2.344946 3.909654 -0.88945
H  -3.872769 3.694767 0.000925
H  -2.34488 3.909394 0.891252
H  -5.043839 -1.778825 -0.890354
H  -5.043689 -1.779173 0.89074
H  -5.84181 -0.458529 0.000517
H  5.818064 0.073928 -1.247015
H  5.81812 0.075337 1.246581
