program: Gaussian 09
title: 000197584
version: EM64L-G09RevD.01
frameworkgroup: C1[X(C18H28Cl2NO3P)]
method: RPBEPBE
basis: SDD
operation: Freq
keyword: #p
keyword: freq=noraman
keyword: PBEPBE/SDD
title: #p freq=noraman PBEPBE/SDD
converged: YES YES NO NO
title: Mulliken charges:
elementType: Cl Cl P O O O N C C C C C C C C C C C C C C C C C C H H H H H H H H H H H H H H H H H H H H H H H H H H H H
charge: -0.009430 -0.007518 1.174938 -0.696517 -0.649824 -0.467249 -0.359848 0.050479 -0.437444 -0.422698 -0.844036 -0.404463 -0.404091 -0.383341 -0.766899 -0.033300 -0.425133 -0.210086 0.523062 -0.725788 -0.335347 -0.464668 -0.083256 -0.190932 -0.117577 0.199628 0.177047 0.281480 0.189771 0.194422 0.296359 0.254290 0.203743 0.191399 0.190624 0.198237 0.189343 0.198681 0.259396 0.235029 0.290956 0.262390 0.178453 0.393406 0.263548 0.206666 0.343422 0.242255 0.210230 0.236562 0.303612 0.242416 0.257602
chargesum: 0.00000
title: Mulliken charges with hydrogens summed into heavy atoms:
elementType: Cl Cl P O O O N C C C C C C C C C C C C C C C C C C
charge: -0.009430 -0.007518 1.174938 -0.303111 -0.649824 -0.123827 -0.096299 0.250108 0.021083 -0.038505 -0.293388 -0.009321 -0.015230 0.004683 -0.272474 0.257656 0.015710 -0.003420 0.523062 -0.036742 -0.031735 -0.222252 -0.083256 0.066670 -0.117577
polarizability: 3.10183833e+02 -1.58474464e+00 2.46784683e+02 2.15518087e+01 -1.86172560e+01 2.02793492e+02
1716.lowfreq: -24.8809 -12.3110 -3.1999 0.0015 0.0018 0.0020 4.1163 8.9284 18.0308
frequency: -23.5873 -3.2093 17.0697 20.8042 23.8299 53.4534 54.8728 73.4656 88.6375 108.5010 124.3107 129.9420 143.3491 161.3013 175.8938 179.9674 185.5887 208.8624 217.1695 224.6170 231.5830 242.2663 246.1351 264.4502 293.0595 309.2487 314.0334 319.4715 343.8785 365.5000 380.1753 400.3245 417.7922 420.7878 425.3368 430.4377 439.3834 449.6110 461.2193 504.0779 530.0399 546.1011 594.6858 615.3391 649.9083 654.8680 663.5522 671.4767 703.7476 712.8914 731.1226 767.3342 780.0110 797.8702 817.8129 819.7564 823.5303 845.3434 883.2132 886.9045 899.1625 921.0848 922.7809 933.8079 946.0145 955.6299 962.3035 996.1096 1005.7436 1011.1971 1031.3116 1051.9272 1053.1559 1063.6441 1074.7486 1084.0711 1088.2585 1102.5969 1108.4681 1114.6121 1120.6461 1139.8451 1145.9850 1162.0299 1163.9809 1168.2196 1191.5772 1199.7088 1218.1507 1237.4080 1242.3862 1242.4670 1254.2018 1260.3738 1269.2625 1271.5969 1296.3013 1313.1367 1318.0223 1322.2904 1327.3290 1332.6595 1339.8280 1342.2519 1345.5690 1359.9017 1365.0155 1371.5410 1375.9013 1387.7455 1394.4299 1403.5001 1423.3974 1449.3183 1456.7443 1457.8709 1458.2696 1464.8436 1468.9226 1473.5486 1475.6606 1477.6536 1482.9975 1573.0495 1594.7237 2819.6597 2858.6344 2932.0134 2952.4535 2958.7880 2962.9296 2965.3111 2966.3662 2980.2924 2991.9270 3000.3553 3013.1898 3025.1772 3029.4975 3037.4402 3042.6232 3043.8626 3062.6421 3069.8011 3076.0312 3084.0569 3101.5707 3129.6988 3156.6702 3169.9585 3350.3853 3466.3112 3538.9657
redmass: 3.0238 6.5668 5.7263 9.7751 7.1689 4.8300 5.5426 3.9940 5.2810 3.9896 3.5884 4.0919 4.9627 4.8384 3.8985 5.7896 14.8613 2.7910 1.9108 2.4925 4.0283 1.3428 2.7533 3.3419 5.6729 2.6467 1.9193 3.2593 1.7266 4.2453 5.4879 2.8723 6.3901 2.3473 2.9324 2.8180 3.1543 3.4477 3.4029 3.4366 1.7173 3.8312 3.6572 2.1472 2.0022 1.9753 5.6689 2.6076 4.0126 3.4644 4.2559 2.3120 1.6254 2.7935 3.0512 1.7744 1.4223 2.2138 1.8428 1.4750 1.6395 2.1085 1.4298 1.8205 2.5223 1.3590 2.4330 2.7545 3.4758 4.8940 1.8615 1.7259 1.4131 1.4101 2.2133 1.9443 1.8947 1.5445 1.7386 2.4417 1.9033 1.7076 2.8949 1.8680 1.4326 1.3372 1.4573 1.3579 1.5687 1.3198 1.3712 1.3034 1.2699 1.2692 1.2921 1.2874 1.2897 1.2847 1.2430 1.9132 1.4992 1.3845 1.4710 1.5199 1.3510 1.2693 1.4941 1.4113 4.5110 1.2097 2.0540 1.1110 1.0829 1.8623 1.0891 1.3433 1.0898 1.0838 1.0874 1.0705 1.0831 1.0907 1.1841 7.6002 6.7167 1.0710 1.0819 1.0810 1.0614 1.0650 1.0636 1.0646 1.0618 1.0372 1.0590 1.0572 1.0994 1.0970 1.0986 1.0995 1.0860 1.1017 1.1017 1.0927 1.0981 1.0989 1.1001 1.0898 1.0917 1.0951 1.0653 1.0744 1.0656
irintensity: 0.3935 0.5052 0.6358 0.3930 0.0796 1.7097 4.1564 1.3327 1.0287 9.3327 1.1853 0.1027 2.1773 2.0066 7.9123 8.6372 0.3926 3.6841 1.0309 0.6265 6.0398 0.1946 9.1620 4.2014 1.7370 27.8592 10.4934 2.0958 194.3538 15.3612 10.7251 8.4793 3.3284 33.9265 5.0849 0.7096 1.2951 11.8119 54.5761 4.2638 4.7741 4.8007 20.1683 31.5777 53.9303 47.5927 15.6673 45.2377 119.0811 4.6776 51.0632 7.7057 0.9308 7.0615 10.0824 25.9897 35.5657 13.8447 3.8319 8.9579 7.3191 7.8614 12.9513 23.5934 60.7365 0.4574 5.7991 21.8593 24.2853 117.8881 11.1894 3.1706 7.3852 9.3232 33.2581 31.1629 5.7194 1.6786 1.1969 0.6120 36.6051 4.2843 80.5789 18.2188 33.4337 89.5328 5.5367 15.8977 43.8370 56.4192 1.5009 3.4539 1.2792 1.4614 51.1377 6.0743 30.5323 1.8085 1.7990 43.4997 0.1195 0.6078 1.0707 1.6512 10.0691 19.5151 7.5471 12.3651 2.4448 18.6266 45.6848 8.3266 8.4042 66.3561 4.9185 13.6637 9.8601 10.0442 12.6164 7.4617 2.8159 7.3995 15.0983 11.0169 1.5558 111.3273 83.3036 8.5512 24.2998 40.4865 18.4485 36.2628 51.3230 32.1262 15.6829 10.1846 59.0200 71.6708 40.8636 50.9849 9.4598 65.6074 11.7709 4.5120 39.3220 16.3708 20.0582 8.7789 2.3769 4.1794 240.9499 0.8963 7.0053
temp: 298.150 k
press: 1.00000 atm
elementType: 17 17 15 8 8 8 7 6 6 6 6 6 6 6 6 6 6 6 6 6 6 6 6 6 6 1 1 1 1 1 1 1 1 1 1 1 1 1 1 1 1 1 1 1 1 1 1 1 1 1 1 1 1
symmnumber: 1
zpe: 1137645.2 jmol-1
zpe.correction: 0.433306 hartree
zpe.thermalcorrener: 0.459291 hartree
zpe.thermalcorrenthalpy: 0.460236 hartree
zpe.thermalcorrgfe: 0.375759 hartree
zpe.sumelectzpe: -2242.524110 hartree
zpe.sumelectthermal: -2242.498124 hartree
zpe.sumelectthermalent: -2242.497180 hartree
zpe.sumelectthermalfe: -2242.581657 hartree
dipole: 0.6165 -8.1746 5.0946
dipole: 9.6519
quadrupole: -175.9912 -166.4120 -179.8800
quadrupole: 10.3102 4.2600 1.6592
quadrupole: -1.8968 7.6824 -5.7856 10.3102 4.2600 1.6592
hfenergy: -2242.9574158 hartree
pointgroup: C01 [X(C18H28Cl2N1O3P1)]
dipole: 0.195083 -0.4301697 -3.7678581 debye
polarizability: 308.4442014|-22.9779847|198.0397998|-11.3828644|-4.8284257|253.278006 unknown
InChI: InChI=1S/C18H28Cl2NO3P/c1-13(15-7-8-17(19)18(20)9-15)21-10-16(22)12-25(23,24)11-14-5-3-2-4-6-14/h7-9,13-14,16,21-23H,2-6,10-12H2,1H3
charge 0 multiplicity 1
53 atoms
Cl -4.427286 -0.680952 2.948934
Cl -7.399039 0.160507 1.806736
P  2.643672 1.295092 0.567056
O  2.722327 3.037455 0.544366
O  2.194801 0.606233 1.945941
O  0.062358 3.004454 -0.21246
N  -1.3704 -0.256282 -1.501125
C  4.864451 -0.516551 0.176936
C  5.146375 -0.776462 1.680784
C  6.137425 -0.786364 -0.671225
C  4.365403 0.92526 -0.076214
C  5.695473 -2.202577 1.915437
C  6.693903 -2.21061 -0.433267
C  6.962252 -2.469395 1.068584
C  1.352587 0.948073 -0.788331
C  -0.019138 1.521985 -0.370916
C  -1.162684 1.192829 -1.354774
C  -2.668805 -0.678561 -2.077106
C  -3.822987 -0.417559 -1.10231
C  -2.587432 -2.185186 -2.425417
C  -3.637825 -0.604747 0.287888
C  -5.102648 -0.049216 -1.582368
C  -4.715304 -0.432688 1.177212
C  -6.184456 0.121362 -0.692553
C  -5.991157 -0.072365 0.690796
H  4.083513 -1.238757 -0.152136
H  5.896323 -0.034461 2.030137
H  4.224985 -0.606135 2.267246
H  5.916493 -0.639007 -1.748131
H  6.912548 -0.039569 -0.39752
H  5.026808 1.665297 0.41295
H  4.347551 1.163958 -1.157316
H  5.915562 -2.346082 2.990761
H  4.913417 -2.944496 1.650236
H  5.959841 -2.956003 -0.804733
H  7.62142 -2.355631 -1.020869
H  7.777049 -1.799047 1.413081
H  7.315695 -3.508132 1.218763
H  1.287831 -0.151366 -0.881944
H  1.703416 1.384101 -1.743004
H  -0.277562 1.156077 0.636869
H  -2.087502 1.634895 -0.942185
H  -0.959452 1.709902 -2.331248
H  1.788759 3.408739 0.531463
H  -0.58446 -0.730286 -1.96205
H  -2.899584 -0.122977 -3.020765
H  0.0110 3.424336 -1.110249
H  -2.35046 -2.772455 -1.520672
H  -1.804167 -2.372711 -3.184909
H  -3.548678 -2.544348 -2.829648
H  -2.64456 -0.871732 0.662463
H  -5.261151 0.109376 -2.655633
H  -7.174304 0.408485 -1.059063
