program: Gaussian 09
title: 000197574
version: EM64L-G09RevD.01
frameworkgroup: C1[X(C20H26N4O4)]
method: RPBEPBE
basis: SDD
operation: Freq
keyword: #p
keyword: freq=noraman
keyword: PBEPBE/SDD
title: #p freq=noraman PBEPBE/SDD
converged: YES YES NO NO
title: Mulliken charges:
elementType: O O O O N N N N C C C C C C C C C C C C C C C C C C C C H H H H H H H H H H H H H H H H H H H H H H H H H H
charge: -0.277836 -0.327578 -0.297672 -0.276491 -0.478208 -0.438478 -0.149308 -0.150814 -0.387245 -0.377742 -0.414995 -0.390752 -0.535801 -0.563714 0.177357 0.243641 0.423221 0.438229 -0.290740 -0.273021 -0.321677 -0.307198 -0.275018 -0.257608 0.121402 0.128601 -0.633924 -0.631101 0.210920 0.208357 0.209372 0.203525 0.205502 0.236478 0.222692 0.219323 0.212118 0.236887 0.257483 0.221517 0.372459 0.317474 0.331301 0.319609 0.263888 0.229608 0.245448 0.256216 0.286033 0.239639 0.238587 0.290507 0.243697 0.245829
chargesum: 0.00000
title: Mulliken charges with hydrogens summed into heavy atoms:
elementType: O O O O N N N N C C C C C C C C C C C C C C C C C C C C
charge: -0.277836 -0.327578 -0.297672 -0.276491 -0.105749 -0.121004 -0.149308 -0.150814 0.032033 0.035156 0.026985 0.051262 -0.086795 -0.084713 0.177357 0.243641 0.423221 0.438229 0.040561 0.046588 -0.057789 -0.077590 -0.029570 -0.001392 0.121402 0.128601 0.130335 0.148932
polarizability: 3.25385098e+02 -2.07456271e-01 2.84584425e+02 -1.14342786e+00 6.45178699e-01 2.19526170e+02
1716.lowfreq: -8.9559 -6.7845 -2.3702 -0.0007 -0.0005 -0.0002 3.3002 17.3513 26.3252
frequency: -5.3468 17.3094 26.2263 30.6211 38.6430 48.5851 50.3077 73.7220 79.8755 80.7214 83.4020 110.0140 116.8313 130.3752 133.8576 143.3291 155.1545 206.9089 208.8571 223.0932 231.5638 255.2142 257.1018 293.8241 300.2153 319.9313 338.1985 345.2933 357.9470 358.4659 373.2958 414.6230 417.4431 418.3554 437.0803 457.1471 463.1999 521.9811 533.6497 552.9079 558.5142 569.0232 571.2012 587.5980 614.3454 647.1254 649.8378 700.2877 703.8535 705.2571 723.7277 724.4441 725.9502 779.5527 798.2582 811.3016 820.9270 825.2000 829.2604 853.5006 860.6511 898.8054 908.3797 912.2461 915.5923 934.0578 942.9718 961.2019 962.4595 970.9411 981.5936 1004.9892 1041.2874 1043.3068 1061.0182 1062.1664 1081.9350 1096.1030 1114.8185 1123.4953 1124.4416 1124.5318 1131.1477 1142.0477 1147.2673 1155.8262 1200.8494 1202.8384 1206.2385 1210.1334 1227.0444 1249.8227 1268.1941 1277.8416 1279.0862 1285.5903 1294.7513 1310.8055 1314.8395 1326.7319 1336.1929 1341.9935 1352.4859 1355.9913 1361.4026 1363.8527 1412.8179 1414.9532 1426.2786 1428.3963 1438.8271 1455.7923 1460.8716 1464.6819 1468.3791 1469.2707 1476.9177 1487.4511 1494.5927 1495.5122 1520.0765 1530.4951 1554.0177 1559.9933 1574.3467 1581.0366 1593.7204 1614.6579 1667.7460 1668.7973 2966.3075 2976.6304 2980.0434 2982.3079 2996.6577 2996.9366 3001.1855 3004.6798 3016.0277 3023.2405 3038.2315 3047.8565 3060.9812 3067.1919 3089.5636 3096.3512 3112.9205 3120.7029 3124.6761 3134.9508 3180.1710 3187.1424 3187.7827 3203.1875 3359.5535 3525.6062
redmass: 5.3292 5.3049 4.3446 4.7292 5.0130 4.9402 4.1528 4.0003 1.2300 1.1211 3.6635 5.1815 5.2681 4.3630 4.3118 3.6374 3.3085 3.6769 3.4704 3.1033 2.8464 3.7041 2.8616 2.8662 5.7336 5.0474 3.1875 4.4346 4.2413 4.2106 3.5969 4.0128 3.6222 3.6451 2.3964 5.0473 4.5782 4.0300 2.8575 3.0154 4.8639 4.5778 5.3795 4.2728 5.3754 1.2668 2.1478 2.4720 4.4926 5.0722 3.9572 2.0727 3.3611 2.2118 4.6242 2.6927 1.6689 1.6120 2.2091 1.1889 2.6152 3.2188 1.3734 1.3726 3.2835 3.2979 3.9267 2.2047 1.3142 2.1574 1.2950 2.7235 2.2555 2.4551 1.9417 2.2299 2.3522 2.1026 2.2556 2.2074 1.3155 1.3177 1.4697 1.6598 1.6973 1.4006 1.8266 1.4130 1.5136 1.5119 1.6808 1.9289 1.7776 1.3796 1.4223 1.4243 1.2146 1.7514 1.7187 1.5904 1.6640 1.4150 1.4936 2.0851 2.1957 1.5335 2.5466 2.4930 1.4527 1.3946 1.1076 1.0887 1.0896 1.1050 1.0751 1.0738 1.0833 1.1045 1.0449 1.0442 2.8087 3.5602 5.8075 4.1977 6.1021 6.7321 3.7415 2.5895 7.0621 6.0006 1.0593 1.0611 1.0609 1.0631 1.0336 1.0643 1.0332 1.0616 1.0968 1.0955 1.1003 1.1007 1.1031 1.1017 1.1028 1.1031 1.0910 1.1004 1.1006 1.0904 1.0952 1.0953 1.0948 1.0945 1.0818 1.0766
irintensity: 0.7591 0.3342 0.0298 0.3799 1.1777 1.0820 0.8079 6.7122 2.1373 0.4705 8.1303 2.1350 5.3257 2.1410 4.9414 4.2072 5.7550 1.5316 0.2208 2.7202 1.4021 3.3266 3.2779 0.7578 3.7265 6.2768 0.6408 2.5323 17.4034 6.1342 0.4331 17.1831 5.0339 7.3702 4.1774 16.4242 5.4964 12.3093 12.5458 8.2744 12.2552 3.4993 3.3335 0.8222 3.3701 53.4257 10.3739 6.5981 3.8548 6.7468 1.6419 19.5539 2.0307 0.6173 7.1314 3.0113 53.7870 7.4263 8.9684 92.3888 11.1536 5.5927 19.9460 29.7473 2.7010 7.1707 1.8735 1.6904 0.0245 7.9639 0.9018 7.2748 10.6783 11.6260 12.9816 5.5506 2.8985 1.1635 28.6638 21.8402 0.8026 0.7873 46.0034 10.7007 5.2109 21.1648 49.6280 15.2852 1.2516 21.7092 23.4805 36.2544 25.8968 12.8577 3.4409 29.0774 19.0924 32.6839 32.8148 0.6660 8.9770 4.5271 6.5706 22.8974 18.5284 4.0697 159.3724 90.1733 83.9316 89.3469 23.0976 14.1171 7.1708 14.2796 69.5727 50.1881 1.7174 19.0977 18.0619 20.5392 322.0300 230.7941 88.6526 251.9485 295.6893 138.0354 328.2081 76.5843 163.5026 133.1287 21.1537 17.0943 29.0483 41.1143 48.1401 29.6608 32.2851 16.3065 3.3956 40.2050 43.5614 29.5070 88.9420 39.7450 22.1305 17.1489 15.2642 0.8548 0.6569 2.1790 2.0245 11.3355 1.4695 9.3308 548.8461 25.1888
temp: 298.150 k
press: 1.00000 atm
elementType: 8 8 8 8 7 7 7 7 6 6 6 6 6 6 6 6 6 6 6 6 6 6 6 6 6 6 6 6 1 1 1 1 1 1 1 1 1 1 1 1 1 1 1 1 1 1 1 1 1 1 1 1 1 1
symmnumber: 1
zpe: 1154485.6 jmol-1
zpe.correction: 0.439720 hartree
zpe.thermalcorrener: 0.466849 hartree
zpe.thermalcorrenthalpy: 0.467794 hartree
zpe.thermalcorrgfe: 0.379893 hartree
zpe.sumelectzpe: -1295.597174 hartree
zpe.sumelectthermal: -1295.570045 hartree
zpe.sumelectthermalent: -1295.569101 hartree
zpe.sumelectthermalfe: -1295.657001 hartree
dipole: 4.5731 7.7323 -2.7010
dipole: 9.3807
quadrupole: -196.1139 -179.6502 -166.4411
quadrupole: 10.6537 -23.6334 -17.7692
quadrupole: -15.3788 1.0849 14.2939 10.6537 -23.6334 -17.7692
hfenergy: -1296.0368942 hartree
pointgroup: C01 [X(C20H26N4O4)]
dipole: 3.1009906 -1.9365566 -0.5045332 debye
polarizability: 284.42587|0.5047804|320.2751686|3.2409608|-22.7004038|224.7946545 unknown
InChI: InChI=1S/C20H26N4O4/c1-23-13-15(9-11-19(23)27)21-17(25)7-5-3-4-6-8-18(26)22-16-10-12-20(28)24(2)14-16/h9-14,21-22H,3-8H2,1-2H3
charge 0 multiplicity 1
54 atoms
O  1.296173 3.909186 1.366016
O  0.814672 -0.91319 -0.369019
O  -3.694411 3.924275 -2.773736
O  -2.470092 -5.659209 2.63952
N  0.549813 1.95279 0.310972
N  1.335621 -3.166264 -0.624247
N  -1.939798 4.290773 -1.230363
N  -1.541553 -3.690333 1.715484
C  4.051639 1.734504 -0.178752
C  3.90111 0.215144 -0.471067
C  3.880468 2.103099 1.316867
C  3.172936 -0.082121 -1.804606
C  2.456049 1.813421 1.875682
C  2.657246 -1.533171 -1.906775
C  1.385568 2.652043 1.172724
C  1.535529 -1.82616 -0.89895
C  -0.519052 2.487563 -0.462498
C  0.350354 -3.768543 0.214278
C  -0.883521 3.834791 -0.458982
C  -0.613665 -3.047983 0.918715
C  -1.272906 1.584622 -1.29318
C  0.355815 -5.201684 0.339504
C  -2.326626 2.044831 -2.064274
C  -0.571761 -5.845575 1.137796
C  -2.734299 3.443104 -2.084588
C  -1.593493 -5.125574 1.888981
C  -2.283527 5.730201 -1.185481
C  -2.547317 -2.877628 2.440692
H  5.038682 2.094688 -0.527725
H  3.297887 2.296596 -0.765348
H  4.894699 -0.276185 -0.46778
H  3.325992 -0.254204 0.349514
H  4.617482 1.546902 1.930254
H  4.089509 3.180502 1.45632
H  2.308149 0.600315 -1.903632
H  3.839927 0.125892 -2.662995
H  2.221202 0.734605 1.810852
H  2.434821 2.092883 2.94487
H  2.253201 -1.71397 -2.924381
H  3.489481 -2.251837 -1.762915
H  0.726593 0.944439 0.173584
H  1.968696 -3.821699 -1.089624
H  -0.344338 4.558701 0.154041
H  -0.661431 -1.960532 0.861351
H  -0.997442 0.523527 -1.307444
H  1.105286 -5.791117 -0.205484
H  -2.908156 1.372397 -2.700562
H  -0.581885 -6.933161 1.243312
H  -3.134459 5.882471 -1.86709
H  -2.569017 6.025037 -0.161054
H  -1.425672 6.340144 -1.516954
H  -3.191139 -3.575888 2.996607
H  -2.049806 -2.191086 3.146659
H  -3.157031 -2.297028 1.727911
