program: Gaussian 09
title: 000197605
version: EM64L-G09RevD.01
frameworkgroup: C1[X(C16H23Br2N5O4)]
method: RPBEPBE
basis: SDD
operation: Freq
keyword: #p
keyword: freq=noraman
keyword: PBEPBE/SDD
title: #p freq=noraman PBEPBE/SDD
converged: NO YES NO NO
title: Mulliken charges:
elementType: Br Br O O O O N N N N N C C C C C C C C C C C C C C C C H H H H H H H H H H H H H H H H H H H H H H H
charge: 0.029574 0.045630 -0.235973 -0.477720 -0.269730 -0.256053 -0.011249 -0.361419 -0.093113 -0.628810 -0.727625 0.196217 -0.596779 -0.111363 -0.230706 0.044126 -0.447495 -0.292018 0.500656 0.182632 -0.396370 -0.399706 -0.355370 -0.373692 -0.452224 -0.511227 0.184479 0.284910 0.264716 0.278644 0.279022 0.420577 0.256266 0.203228 0.242505 0.208501 0.340446 0.185724 0.224693 0.194974 0.216909 0.228439 0.152443 0.244117 0.239210 0.236972 0.363006 0.308644 0.336268 0.335114
chargesum: 0.00000
title: Mulliken charges with hydrogens summed into heavy atoms:
elementType: Br Br O O O O N N N N N C C C C C C C C C C C C C C C C
charge: 0.029574 0.045630 -0.235973 -0.057143 -0.269730 -0.256053 -0.011249 -0.020973 -0.093113 0.042840 -0.056244 0.196217 -0.047153 0.167281 0.048315 0.044126 -0.447495 -0.292018 0.500656 0.182632 0.054636 0.059788 0.055047 0.038191 -0.071342 0.209072 0.184479
polarizability: 3.73642973e+02 -2.75813296e+00 2.56206364e+02 4.24980498e+00 1.40043030e+00 1.80825542e+02
1716.lowfreq: -5.9117 -3.2620 -0.0006 -0.0004 -0.0004 4.2359 15.3145 24.4192 33.3653
frequency: 15.2957 24.3364 33.3609 38.7130 50.0984 56.5653 64.3415 77.3763 95.5417 103.7792 108.4377 120.4134 124.4608 124.7654 134.7486 153.4706 159.8738 173.2985 181.1288 195.4405 207.1879 217.5351 237.0567 243.6377 249.0540 279.1023 293.5969 296.0214 311.0234 325.1605 339.0158 356.8506 385.0527 415.5178 432.6137 443.7065 445.9920 454.6742 485.1636 489.5697 500.5331 535.5396 554.6815 567.6385 576.2135 604.3901 622.3972 625.8832 648.0484 670.4310 684.8337 698.2074 708.6475 728.8893 765.6222 775.5140 784.5871 817.3080 825.0007 838.7760 862.3922 871.7538 894.8688 904.9838 912.7360 918.4597 943.7381 961.3576 978.3552 991.3694 1019.4277 1032.4656 1040.4479 1054.2754 1079.4195 1081.4357 1085.3584 1104.2093 1105.7620 1117.5433 1122.6293 1144.7146 1153.5553 1166.3215 1176.2162 1182.6419 1189.6007 1223.6634 1229.5182 1245.3897 1256.8548 1260.7745 1271.7165 1292.0937 1293.6974 1307.2572 1320.8193 1337.5046 1339.2829 1344.5634 1348.3872 1349.6345 1366.4187 1419.0036 1432.4635 1450.8548 1454.2316 1454.7273 1461.2804 1461.4787 1465.6808 1469.4080 1476.9604 1509.8249 1539.9710 1572.3871 1602.7102 1610.3638 1616.5952 1639.0321 1691.7569 2672.8339 2872.0675 2959.3006 2969.0648 2979.5906 2979.9053 2981.5838 2997.5327 3010.8795 3019.6216 3025.5236 3045.0035 3053.6891 3071.3528 3077.5102 3081.9400 3133.5085 3164.8185 3400.5399 3442.7258 3522.2506 3533.6174 3646.9381
redmass: 8.1329 5.9100 5.3845 5.1473 8.0897 6.1195 6.1318 4.8209 5.7597 3.6597 4.2320 5.7408 4.6751 1.1185 2.8030 4.7877 4.8836 2.9908 4.4305 3.1897 4.6982 10.0965 8.1425 5.5447 3.6859 4.4758 4.6125 4.7234 3.4817 3.3057 6.4403 5.2541 5.2197 4.8281 1.4587 3.6041 1.9037 2.6697 1.4301 2.6421 4.6044 2.7548 3.1661 6.0292 5.3186 1.2047 1.1991 3.6305 8.0435 7.2302 6.9647 8.4162 4.7703 1.3372 3.8225 3.5567 2.7411 4.0720 1.6276 2.5721 6.3972 2.2262 4.5959 2.8330 2.5299 2.2242 1.5323 4.1322 1.9204 6.5166 2.6533 4.4391 2.6797 1.2915 2.5185 2.6252 2.6569 1.9416 1.2452 2.1455 1.6327 1.6530 1.7684 2.8241 1.5592 2.4158 1.6066 1.5942 2.0267 1.5311 1.2749 1.4585 1.2825 1.2445 1.6107 1.1167 1.2892 2.8798 1.3510 1.4853 1.5846 1.8149 1.5076 1.1573 1.1615 1.0830 1.1237 1.1416 1.0830 1.0531 1.0515 1.0967 1.1021 1.8918 7.6063 10.0370 6.5364 1.1558 9.3821 1.1509 5.1040 1.0847 1.0690 1.0646 1.0813 1.0618 1.0304 1.0632 1.0612 1.0880 1.0637 1.0902 1.1016 1.1036 1.1017 1.1055 1.0990 1.1021 1.0929 1.0477 1.0552 1.0783 1.0935 1.0937
irintensity: 0.1733 0.6280 0.1724 0.8812 3.1350 0.3121 1.7908 14.6608 0.0030 2.5928 2.1097 0.9886 3.3871 0.2551 1.3982 4.4151 0.5103 2.2218 4.2334 6.6167 1.1247 9.0342 5.0084 28.4490 2.7006 7.3665 12.0887 16.3738 14.9394 12.5261 2.9347 3.8962 2.0423 3.5314 30.8017 20.1832 44.0865 17.1580 54.6844 15.2379 8.1230 1.2633 8.6623 3.7232 1.8088 187.8720 140.0586 14.0515 26.1569 57.4231 33.7787 70.4729 9.6950 7.2916 38.2474 4.6926 32.8388 11.9696 11.3634 22.4204 41.5426 1.5409 2.0982 14.1114 21.0604 101.2757 174.9863 22.7529 22.4007 8.8675 8.5512 147.2701 15.5281 90.2038 55.0825 5.4176 1.7792 26.6101 1.3404 0.6515 36.3148 23.4017 22.5646 39.6106 7.7163 71.8258 6.3448 3.4035 9.1218 47.8433 17.1938 31.3800 12.7697 1.8968 68.3445 5.8941 7.0292 9.6597 2.3979 13.6319 22.1856 210.4492 5.7622 300.5032 18.4107 10.1126 53.4201 31.8674 10.0647 11.2058 9.6647 16.3153 13.5297 245.0973 101.6617 63.1127 149.6355 71.8916 14.6907 89.4202 353.4932 1323.6867 90.3294 28.5806 1.8604 4.5407 61.3507 46.4000 83.5346 63.4349 2.2165 23.5614 23.0895 28.2655 63.7363 23.6823 0.5409 17.8157 1.1722 6.3106 183.6231 30.8551 18.8273 54.3294
temp: 298.150 k
press: 1.00000 atm
elementType: 35 35 8 8 8 8 7 7 7 7 7 6 6 6 6 6 6 6 6 6 6 6 6 6 6 6 6 1 1 1 1 1 1 1 1 1 1 1 1 1 1 1 1 1 1 1 1 1 1 1
symmnumber: 1
zpe: 1018801.2 jmol-1
zpe.correction: 0.388041 hartree
zpe.thermalcorrener: 0.416930 hartree
zpe.thermalcorrenthalpy: 0.417875 hartree
zpe.thermalcorrgfe: 0.325902 hartree
zpe.sumelectzpe: -1222.919838 hartree
zpe.sumelectthermal: -1222.890949 hartree
zpe.sumelectthermalent: -1222.890005 hartree
zpe.sumelectthermalfe: -1222.981978 hartree
dipole: 0.6095 2.3492 2.4947
dipole: 3.4805
quadrupole: -153.8670 -175.7942 -188.0615
quadrupole: -4.2216 9.4333 1.7533
quadrupole: 18.7073 -3.2200 -15.4873 -4.2216 9.4333 1.7533
hfenergy: -1223.3078792 hartree
pointgroup: C01 [X(C16H23Br2N5O4)]
dipole: 0.2415976 0.9018594 1.0016754 debye
polarizability: 365.9963147|-18.9131892|259.3974478|29.1138661|-3.4514752|185.2811168 unknown
InChI: InChI=1S/C16H23Br2N5O4/c1-26-12-9(17)7-16(13(24)11(12)18)8-10(23-27-16)14(25)21-5-3-2-4-6-22-15(19)20/h7,13,21,24H,2-6,8,19-20H2,1H3
charge 0 multiplicity 1
50 atoms
Br -1.991525 3.505286 -0.242413
Br -5.652426 -0.881585 -1.31079
O  -1.342975 -1.542537 1.648849
O  -0.195015 1.142115 0.862994
O  -4.401099 1.952714 -1.56825
O  2.054768 -2.539474 -1.370113
N  -0.033478 -2.13405 1.52861
N  2.598465 -2.820441 0.895629
N  3.770869 1.960824 -0.598941
N  2.271783 2.625422 1.225041
N  1.445046 2.170934 -0.939967
C  -1.666486 -0.787716 0.328194
C  -0.559189 -1.28742 -0.641222
C  -1.56451 0.721303 0.732973
C  -3.052161 -1.203153 -0.098798
C  0.405627 -1.981307 0.295492
C  -2.437491 1.602912 -0.168736
C  -3.913099 -0.294869 -0.630744
C  -3.583691 1.149708 -0.768307
C  1.752089 -2.480446 -0.133904
C  4.006363 -3.210255 0.684501
C  4.8633 -2.099031 0.021346
C  4.704595 -0.709798 0.67493
C  5.567474 0.380669 -0.003119
C  4.992116 1.804387 0.214509
C  -5.471392 2.701576 -0.863631
C  2.611475 2.249687 -0.074638
H  -0.949641 -2.003026 -1.387243
H  -0.071054 -0.472049 -1.199166
H  -1.979846 0.781059 1.761672
H  -3.290557 -2.269317 -0.044387
H  0.301338 1.364344 -0.024855
H  4.579501 -2.0238 -1.043957
H  5.922326 -2.426518 0.056068
H  4.042593 -4.117588 0.051707
H  4.4162 -3.471825 1.677278
H  2.2353 -2.718463 1.847345
H  4.945424 -0.762127 1.758027
H  3.641914 -0.410125 0.600031
H  6.610982 0.339445 0.367865
H  5.59859 0.203946 -1.09546
H  5.731086 2.553709 -0.130179
H  4.85054 1.967499 1.311954
H  -5.97111 3.287202 -1.648733
H  -5.037248 3.376785 -0.104144
H  -6.189456 2.0033 -0.396491
H  1.331706 2.397163 1.567915
H  3.014012 2.755889 1.908168
H  0.939094 3.065699 -1.025659
H  1.738978 1.806444 -1.855549
