program: Gaussian 09
title: 000197575
version: EM64L-G09RevD.01
frameworkgroup: C1[X(C22H30N4O4)]
method: RPBEPBE
basis: SDD
operation: Freq
keyword: #p
keyword: freq=noraman
keyword: PBEPBE/SDD
title: #p freq=noraman PBEPBE/SDD
converged: YES YES NO NO
title: Mulliken charges:
elementType: O O O O N N N N C C C C C C C C C C C C C C C C C C C C C C H H H H H H H H H H H H H H H H H H H H H H H H H H H H H H
charge: -0.271760 -0.270580 -0.287894 -0.338508 -0.445339 -0.463560 -0.137168 -0.124485 -0.422534 -0.377770 -0.357590 -0.386635 -0.380680 -0.403329 -0.545853 -0.557014 0.187007 0.217795 0.454216 0.457650 -0.295155 -0.280046 -0.317904 -0.312346 -0.282234 -0.271388 0.130735 0.176708 -0.645023 -0.619332 0.199260 0.196436 0.191596 0.201525 0.212636 0.183616 0.236533 0.192663 0.244360 0.198999 0.202709 0.231137 0.237675 0.199237 0.240436 0.215121 0.303752 0.302654 0.345781 0.323347 0.220482 0.225629 0.248543 0.249448 0.253264 0.244734 0.303870 0.262961 0.285211 0.216400
chargesum: 0.00000
title: Mulliken charges with hydrogens summed into heavy atoms:
elementType: O O O O N N N N C C C C C C C C C C C C C C C C C C C C C C
charge: -0.271760 -0.270580 -0.287894 -0.338508 -0.141587 -0.160906 -0.137168 -0.124485 -0.026838 0.015350 0.038663 0.042562 0.062679 0.030518 -0.108941 -0.101457 0.187007 0.217795 0.454216 0.457650 0.050626 0.043301 -0.097422 -0.086716 -0.033691 -0.021941 0.130735 0.176708 0.156845 0.145240
polarizability: 4.24985476e+02 -3.31792058e+01 2.48562578e+02 -1.75432342e+01 -1.93125699e+00 2.12057393e+02
1716.lowfreq: -17.5734 -2.8400 -0.0006 -0.0005 -0.0004 3.4774 6.6135 25.1600 29.1567
frequency: -10.6151 24.7261 28.7196 31.9302 40.1543 54.9955 60.7140 67.4770 80.0149 83.4521 101.4874 104.5276 105.1489 109.0989 134.1935 143.0251 146.7233 158.0699 161.5851 180.2075 202.3430 211.6884 220.3049 226.4580 251.3882 278.4817 289.3722 298.8360 306.3475 323.5432 341.3619 349.5831 354.2798 362.6738 373.9278 420.5595 424.0002 438.9519 461.5363 466.8698 494.8055 522.0180 534.5901 549.1139 554.5445 570.4907 571.3137 602.6151 618.1002 625.1125 631.6968 675.1058 700.0461 714.8217 717.3118 725.0068 726.1642 727.8725 752.0193 781.6693 803.1242 808.9628 816.7806 818.2558 832.1896 848.5786 877.8262 888.7962 909.9060 934.5158 936.2467 938.0468 944.3391 947.9705 956.0067 956.5741 966.1671 1000.2995 1022.6082 1030.7147 1053.0868 1056.4437 1081.4683 1085.4989 1095.4398 1115.8716 1119.6118 1119.7771 1121.3978 1127.4999 1129.6422 1138.4930 1145.8580 1148.7987 1166.6042 1208.0775 1210.9936 1214.4060 1221.1593 1235.8596 1251.9752 1263.8812 1267.9051 1273.1355 1282.8939 1292.1136 1293.7470 1307.8604 1317.1878 1320.0472 1327.7899 1340.6189 1347.5638 1348.2022 1358.3001 1363.8482 1366.9643 1369.8145 1406.7498 1411.3085 1429.0432 1448.0417 1448.9308 1451.5830 1456.5207 1458.3091 1463.3582 1470.1568 1472.9594 1474.2424 1480.8360 1486.2875 1486.9490 1490.8937 1508.7912 1513.6912 1550.3260 1553.0232 1566.0076 1575.1449 1603.0521 1608.9535 1662.1724 1664.3914 2953.5004 2959.5601 2970.3674 2972.7714 2973.1349 2977.6301 2977.8909 2990.2141 2999.5636 3001.2770 3010.1026 3010.3942 3024.0772 3030.3225 3036.8287 3042.3651 3059.7008 3060.8232 3093.3035 3103.3400 3109.8425 3110.2219 3126.3204 3133.3734 3183.4597 3184.6524 3194.5248 3199.1593 3535.2140 3535.5816
redmass: 5.2788 4.8000 4.8843 5.6609 5.7262 5.5619 5.6034 6.7937 4.8875 6.6116 2.7617 1.0919 2.6354 4.5906 3.8050 4.5911 2.7738 1.3179 2.8293 3.3823 2.5175 2.9641 3.0703 3.5207 3.0023 2.4067 3.3639 6.5112 5.3935 3.0709 3.7524 4.2436 4.0595 4.1886 3.1030 3.7104 3.6602 2.9466 5.2104 4.2000 2.5144 3.9778 3.0718 2.7982 3.5859 5.3215 5.4573 4.2669 1.2055 1.1651 4.9308 2.3501 4.6187 2.2734 2.5743 4.1496 4.2559 3.7977 1.3074 1.6881 4.1077 3.4425 1.6801 1.6661 2.1361 2.1431 2.4297 2.1723 1.3824 2.3563 1.7615 3.3285 3.1039 3.6958 1.3153 1.3279 2.2102 2.1859 1.7468 2.9733 2.1967 2.3130 1.8482 1.7183 3.0690 1.7247 1.4139 1.9192 1.8638 1.6068 1.3367 1.7708 1.5594 1.5659 1.6723 1.7633 1.6972 1.6672 1.6743 1.5629 1.3066 1.5819 1.5186 1.7345 1.1951 1.1640 1.1864 1.2639 1.6995 1.5991 1.5051 1.5494 1.3737 1.4939 1.4498 1.4849 2.6790 3.2125 2.6065 2.5039 1.3807 1.0992 1.0568 1.2746 1.1237 1.1043 1.0787 1.0826 1.0782 1.0488 1.0958 1.1131 1.1011 1.0924 2.6708 2.5903 5.4158 5.5156 5.2111 5.2086 4.4206 4.7059 6.7677 6.6553 1.0601 1.0605 1.0620 1.0611 1.0622 1.0599 1.0644 1.0641 1.0330 1.0979 1.0968 1.0327 1.0969 1.1007 1.0983 1.1005 1.1016 1.1029 1.0997 1.0907 1.0913 1.1008 1.1065 1.1031 1.0946 1.0947 1.0954 1.0953 1.0764 1.0766
irintensity: 0.1660 0.2955 0.2870 0.5234 0.1097 5.5383 0.1677 10.5165 0.2746 15.9851 0.4381 0.0642 0.8839 1.8332 4.5408 2.6642 3.5429 0.5683 10.1886 4.6791 6.0269 3.1112 0.7528 0.0247 1.0227 1.7697 2.1024 1.0318 3.7754 2.8895 2.6622 7.7190 20.5855 2.3318 1.0872 4.2861 10.7801 10.2363 21.0391 7.6120 2.4074 9.9489 16.3240 11.8772 12.6691 2.0182 1.0729 6.5798 78.6537 53.8121 0.5648 1.0581 1.9204 6.5547 9.8296 1.3897 7.8014 0.0770 11.8274 3.2257 2.6448 3.2162 58.6300 64.5043 1.5089 1.9942 2.3345 4.4719 25.8740 9.9957 13.2135 3.0601 3.6317 1.1972 0.2376 0.1714 2.6363 1.2300 2.2149 7.6807 5.9521 21.9629 7.6091 3.0455 3.0316 2.7156 46.2966 2.8008 6.2555 41.4888 3.9056 23.5268 4.7573 8.5369 25.8700 34.5358 28.7029 18.0762 13.9822 14.6096 5.6323 26.9038 26.1764 12.6044 8.7676 9.7310 4.1054 10.8189 16.5820 22.9026 7.7373 1.3096 2.0351 3.7120 0.8063 0.1590 62.2186 12.4044 206.7582 89.1301 65.0419 17.3654 16.8306 90.1481 12.6146 19.4673 10.5486 1.6415 6.5847 16.9581 26.7285 1.7309 1.5160 16.4563 231.8834 186.2824 7.1338 133.8583 335.3358 260.6026 271.0513 129.5304 256.2192 55.9530 15.4842 27.2332 34.3016 4.6188 31.3312 17.7984 81.4283 53.0387 40.5828 5.5992 21.4158 24.9353 41.3015 12.1734 9.3316 117.9544 21.8632 91.7213 12.3630 19.9645 16.6123 9.8990 30.5344 3.7506 2.1545 2.1308 47.7449 9.0291 15.2827 14.2540
temp: 298.150 k
press: 1.00000 atm
elementType: 8 8 8 8 7 7 7 7 6 6 6 6 6 6 6 6 6 6 6 6 6 6 6 6 6 6 6 6 6 6 1 1 1 1 1 1 1 1 1 1 1 1 1 1 1 1 1 1 1 1 1 1 1 1 1 1 1 1 1 1
symmnumber: 1
zpe: 1301789.2 jmol-1
zpe.correction: 0.495825 hartree
zpe.thermalcorrener: 0.525442 hartree
zpe.thermalcorrenthalpy: 0.526386 hartree
zpe.thermalcorrgfe: 0.434503 hartree
zpe.sumelectzpe: -1374.040885 hartree
zpe.sumelectthermal: -1374.011269 hartree
zpe.sumelectthermalent: -1374.010324 hartree
zpe.sumelectthermalfe: -1374.102207 hartree
dipole: -8.7200 4.5182 -1.9003
dipole: 10.0032
quadrupole: -225.6948 -164.9358 -170.4068
quadrupole: 7.7324 20.6160 4.4049
quadrupole: -38.6823 22.0766 16.6057 7.7324 20.6160 4.4049
hfenergy: -1374.5367101 hartree
pointgroup: C01 [X(C22H30N4O4)]
dipole: 3.5922358 -1.4663037 -0.6591944 debye
polarizability: 429.4064374|-14.8902129|244.064043|19.716368|2.2090969|212.1349663 unknown
InChI: InChI=1S/C22H30N4O4/c1-25-15-17(11-13-21(25)29)23-19(27)9-7-5-3-4-6-8-10-20(28)24-18-12-14-22(30)26(2)16-18/h11-16,23-24H,3-10H2,1-2H3
charge 0 multiplicity 1
60 atoms
O  -0.662522 -0.446547 1.013496
O  4.062284 1.964468 1.042494
O  -6.927055 -0.910668 -0.867212
O  -2.313815 2.619154 0.036551
N  -1.718635 -2.462253 0.470601
N  3.108287 1.914378 -1.093166
N  -4.728848 -0.344682 -0.237306
N  -0.077562 2.528872 0.757329
C  4.14923 -3.07382 -0.574896
C  4.753168 -1.685474 -0.90847
C  3.039404 -3.083076 0.507567
C  5.397114 -0.981792 0.310309
C  1.756955 -2.304749 0.128921
C  6.237657 0.274237 -0.028947
C  0.636377 -2.524198 1.18332
C  5.494886 1.351642 -0.863752
C  -0.627827 -1.712654 0.890731
C  4.176054 1.775472 -0.209039
C  -3.032712 -2.023793 0.124147
C  1.74406 2.188949 -0.787794
C  -3.432353 -0.68421 0.09987
C  1.265787 2.335365 0.515689
C  -3.998774 -3.031145 -0.216824
C  0.805832 2.27418 -1.870106
C  -5.296071 -2.686778 -0.556843
C  -0.544652 2.457074 -1.619826
C  -5.74924 -1.303793 -0.579551
C  -1.072579 2.541538 -0.269982
C  -5.145451 1.0795 -0.247592
C  -0.565262 2.57109 2.153833
H  4.970088 -3.739978 -0.237761
H  3.744289 -3.524397 -1.504787
H  5.519966 -1.820767 -1.700113
H  3.966125 -1.037461 -1.344037
H  3.438414 -2.68226 1.460894
H  2.766161 -4.13978 0.710571
H  4.612821 -0.692303 1.035309
H  6.054112 -1.705596 0.835084
H  1.962089 -1.220252 0.054013
H  1.400138 -2.637072 -0.867488
H  7.147582 -0.019714 -0.589383
H  6.571814 0.739251 0.916851
H  1.013189 -2.198961 2.171511
H  0.412287 -3.607442 1.259865
H  6.144568 2.245503 -0.945265
H  5.319953 0.984563 -1.893736
H  -1.576145 -3.472915 0.414684
H  3.311432 1.755671 -2.082298
H  -2.748814 0.130954 0.341227
H  1.940635 2.286612 1.370443
H  -3.702837 -4.089288 -0.205665
H  1.161412 2.186962 -2.905596
H  -6.042634 -3.441147 -0.817826
H  -1.277529 2.512764 -2.428543
H  -5.670138 1.28939 -1.193781
H  -5.863209 1.259551 0.571607
H  -4.259607 1.72344 -0.140265
H  -1.440118 3.236584 2.20473
H  -0.87291 1.554714 2.452618
H  0.238725 2.936686 2.811385
