program: Gaussian 09
title: 000201692
version: EM64L-G09RevD.01
frameworkgroup: C1[X(C25H32N2S)]
method: RPBEPBE
basis: SDD
operation: Freq
keyword: #p
keyword: freq=noraman
keyword: PBEPBE/SDD
title: #p freq=noraman PBEPBE/SDD
converged: YES YES NO NO
title: Mulliken charges:
elementType: S N N C C C C C C C C C C C C C C C C C C C C C C C C C H H H H H H H H H H H H H H H H H H H H H H H H H H H H H H H H
charge: 0.207565 -0.084168 -0.282424 0.466477 -0.510223 -0.517320 -0.479521 -0.514636 -0.459137 -0.448753 -0.389960 -0.388795 -0.325082 -0.442693 -0.404338 0.489509 0.498626 -0.360695 -0.354220 -0.320294 -0.333502 -0.417695 -0.269858 -0.452040 0.465405 -0.241135 -0.257086 -0.812196 0.197382 0.218765 0.216726 0.201004 0.202960 0.200567 0.214331 0.189856 0.206374 0.225228 0.217051 0.208781 0.200965 0.181594 0.185259 0.221617 0.181530 0.227247 0.203813 0.240060 0.203768 0.248042 0.244123 0.238845 0.248548 0.245511 0.230379 0.225224 0.229663 0.231721 0.228321 0.222938
chargesum: 0.00000
title: Mulliken charges with hydrogens summed into heavy atoms:
elementType: S N N C C C C C C C C C C C C C C C C C C C C C C C C C
charge: 0.207565 -0.084168 -0.282424 0.466477 -0.094077 -0.099590 -0.075995 -0.110449 -0.027535 -0.022921 -0.007402 0.018081 0.083695 0.001179 0.047472 0.489509 0.498626 -0.360695 -0.354220 -0.076171 -0.094656 -0.169147 -0.024347 -0.221661 0.465405 -0.015911 -0.027423 -0.129216
polarizability: 3.48314331e+02 -6.14593166e+01 3.08214079e+02 -3.42835036e+01 -1.33652319e+01 2.38434861e+02
1716.lowfreq: -23.3883 -9.3287 -3.0925 0.0013 0.0015 0.0016 6.7580 11.5119 15.1470
frequency: -19.6815 8.8984 14.1854 24.1140 38.2181 46.8949 56.3960 60.5046 84.2499 108.0209 125.2429 140.4926 165.8328 177.0687 205.4892 210.0521 223.3052 255.4639 264.3054 287.1288 297.4275 303.0214 338.3217 343.6618 355.4920 357.3003 385.3750 403.2444 409.8823 414.3887 417.8672 431.0553 437.8006 475.3189 478.5020 509.0286 533.9488 543.3958 546.4452 561.2337 597.1142 612.0455 631.8976 652.9265 676.5540 692.1495 695.5069 716.8967 722.9515 733.0389 750.6343 788.4681 803.6639 808.2505 811.6690 820.8821 833.3750 848.5138 870.6194 877.7992 878.6184 886.0211 899.4870 927.5716 929.6477 938.8378 949.7224 960.7692 968.7435 972.7578 989.9485 996.5812 1003.6540 1020.8799 1027.2523 1036.4401 1042.4644 1043.5056 1045.7949 1049.4672 1055.3386 1065.2912 1088.0240 1100.0892 1113.4345 1122.2153 1129.2778 1136.5817 1156.9300 1158.5425 1172.7927 1175.9676 1185.3649 1195.2551 1199.9307 1212.1253 1220.5530 1223.3574 1242.2968 1252.1381 1252.6520 1268.7602 1272.7625 1278.4616 1285.2982 1289.4860 1295.7832 1300.7151 1316.8973 1323.5538 1326.6540 1328.9677 1337.9079 1347.0763 1353.0994 1358.2169 1371.8895 1374.4939 1378.3613 1392.1384 1398.1648 1402.2591 1429.5392 1443.5272 1454.6253 1457.0433 1461.0940 1463.7462 1466.6472 1470.1616 1471.7272 1472.5246 1476.0663 1479.1456 1480.6485 1486.3454 1491.6483 1492.5421 1561.4580 1577.9500 1591.7958 1620.0100 2824.5191 2841.2690 2869.7281 2952.4402 2968.9996 2972.9257 2973.6788 2975.6059 2981.7215 2993.2081 2994.0823 3009.3487 3020.7748 3026.2569 3029.7532 3031.2555 3031.8591 3036.6809 3044.0145 3051.5158 3051.9783 3052.7155 3073.8354 3079.8053 3082.4566 3125.3477 3129.5978 3130.3846 3140.5749 3157.5416 3158.5566 3169.9251
redmass: 3.3148 4.8927 3.8244 1.0763 3.7115 4.9467 3.5218 2.1185 3.9288 3.5693 3.4672 3.0444 4.2074 3.9729 2.7968 2.9667 3.6251 3.2828 2.4101 3.5176 3.2571 2.5943 4.1134 2.4412 2.6650 2.9136 3.1051 2.4857 1.9025 5.2347 4.1679 3.6819 3.3378 2.9305 3.5939 3.2762 4.0635 4.0807 3.5400 4.0037 2.4557 3.4737 2.5964 5.1597 6.7211 4.5995 1.9342 4.2128 3.2641 2.5914 1.3851 1.6243 1.5670 1.5698 1.3909 1.7841 4.0427 1.4269 2.9048 1.6540 2.0597 3.7706 2.3676 1.4041 2.0349 1.3481 2.2128 1.8781 1.3126 2.0277 1.7922 1.4766 1.6714 2.6682 4.1225 2.2863 2.0275 2.1596 1.5258 2.1641 1.9305 1.9344 2.4284 2.8332 2.1293 2.2450 1.6800 2.2243 1.4880 2.1213 1.0815 1.1533 1.2478 1.5467 1.2815 1.4613 1.7679 1.2040 2.0529 1.6205 1.8299 1.4368 1.3353 1.3935 1.8291 1.3725 1.3466 1.4171 1.3408 1.8863 1.6613 1.5323 1.4325 1.3999 1.6050 2.0442 1.4011 2.6152 3.6408 1.4233 1.2810 3.3443 2.4091 1.0872 1.0896 1.1094 1.1187 2.1202 1.1221 1.0601 1.0826 1.0824 1.1297 1.1090 1.1251 1.1617 1.1008 2.3900 5.8629 6.7167 6.5876 6.9748 1.0720 1.0705 1.0707 1.0689 1.0600 1.0611 1.0377 1.0603 1.0623 1.0614 1.0637 1.0667 1.0856 1.0897 1.0973 1.0943 1.0956 1.1010 1.0983 1.0968 1.1030 1.0978 1.1045 1.0922 1.0987 1.0888 1.0913 1.0851 1.0902 1.0937 1.0943 1.1001
irintensity: 0.0846 0.0738 0.1228 0.4233 0.1790 1.1768 0.5000 0.0876 0.0867 0.5325 0.2985 0.0087 1.2581 0.7329 1.3806 0.9003 0.4862 4.1059 0.2207 2.0216 0.6744 0.6952 3.2480 0.0775 2.8378 6.9533 6.2352 0.1737 1.6749 1.5232 6.9599 11.9132 0.6023 0.6003 6.2096 1.1084 3.9969 1.8661 1.0623 3.1672 3.5853 4.5603 1.7544 2.9633 4.3088 7.5701 2.6490 2.9114 1.2362 34.6003 85.5316 4.3181 0.7264 0.4992 50.0684 10.4087 17.1576 1.1311 0.3358 3.0760 1.7402 4.2846 7.0266 3.2208 0.3058 1.5309 13.6292 1.2831 0.2727 25.7848 10.6875 1.6896 4.8060 4.7328 14.4417 3.0851 9.6051 0.9045 12.9134 1.8099 6.0238 0.9597 0.7953 16.0843 14.3344 22.2718 2.5996 18.0117 10.9522 15.9482 1.5202 3.7349 2.3239 3.1290 20.8757 32.9770 29.6185 5.4870 38.0795 25.4997 25.4042 0.2540 2.3556 0.9022 1.5503 2.9605 24.2902 6.4835 3.2525 120.1333 8.7051 5.5723 6.0984 9.3040 5.1316 5.1509 2.6582 13.2541 4.0596 0.5267 5.5199 1.8646 14.1421 5.6063 6.5144 35.0123 14.5241 222.8676 22.0472 12.8023 13.2148 7.7491 18.6000 4.8233 18.5921 13.2221 10.8557 86.6415 0.9351 0.8519 23.9728 12.0650 72.5102 85.0233 141.8219 50.6661 8.0405 38.1657 60.8791 46.7196 30.4065 35.3596 36.5769 63.6739 55.4879 10.4204 20.2030 37.0491 15.0659 93.4444 12.8157 22.3980 11.7536 42.1663 106.6727 8.7803 19.4339 18.1155 12.2562 1.2609 8.9002 15.3474 23.1899 20.5962
temp: 298.150 k
press: 1.00000 atm
elementType: 16 7 7 6 6 6 6 6 6 6 6 6 6 6 6 6 6 6 6 6 6 6 6 6 6 6 6 6 1 1 1 1 1 1 1 1 1 1 1 1 1 1 1 1 1 1 1 1 1 1 1 1 1 1 1 1 1 1 1 1
symmnumber: 1
zpe: 1344850.2 jmol-1
zpe.correction: 0.512226 hartree
zpe.thermalcorrener: 0.537535 hartree
zpe.thermalcorrenthalpy: 0.538479 hartree
zpe.thermalcorrgfe: 0.454200 hartree
zpe.sumelectzpe: -1477.337501 hartree
zpe.sumelectthermal: -1477.312192 hartree
zpe.sumelectthermalent: -1477.311248 hartree
zpe.sumelectthermalfe: -1477.395527 hartree
dipole: -0.9227 -1.5402 1.1519
dipole: 2.1332
quadrupole: -169.3169 -168.0758 -172.2690
quadrupole: -7.3124 -2.1029 -3.6265
quadrupole: 0.5703 1.8114 -2.3818 -7.3124 -2.1029 -3.6265
hfenergy: -1477.8497275 hartree
pointgroup: C01 [X(C25H32N2S1)]
dipole: -0.328912 0.5865749 -0.5021014 debye
polarizability: 352.3499007|62.1457408|300.7082978|31.2381244|-18.2019491|241.9050729 unknown
InChI: InChI=1S/C25H32N2S/c1-20-9-10-22-24(19-20)28-23-8-3-2-7-21(23)27(22)16-6-15-26-17-13-25(14-18-26)11-4-5-12-25/h2-3,7-10,19H,4-6,11-18H2,1H3
charge 0 multiplicity 1
60 atoms
S  2.697391 -1.201655 1.956053
N  -1.718905 1.162758 0.117948
N  1.632358 -0.098636 -0.692878
C  -4.588246 0.343616 0.246213
C  -5.721398 -0.586309 -0.275903
C  -5.37143 1.232766 1.263442
C  -3.989941 1.195212 -0.91385
C  -3.433914 -0.463372 0.894428
C  -6.978275 0.317802 -0.412839
C  -6.768883 1.481319 0.617694
C  -2.768688 2.027614 -0.47116
C  -2.236038 0.41994 1.295366
C  -0.450351 1.882383 0.388437
C  0.396898 2.084821 -0.889286
C  0.756239 0.734347 -1.55113
C  2.932969 0.38655 -0.352805
C  1.3153 -1.475866 -0.483812
C  3.600365 -0.079877 0.813664
C  1.786867 -2.155406 0.675314
C  3.617419 1.33227 -1.160959
C  0.544337 -2.220655 -1.418794
C  4.897805 0.352158 1.14199
C  1.509139 -3.519121 0.891689
C  4.904097 1.794084 -0.807419
C  5.5723 1.313553 0.344123
C  0.230343 -3.576397 -1.182942
C  0.710928 -4.23576 -0.029747
C  6.954965 1.810083 0.729193
H  -5.903594 -1.3810 0.475755
H  -5.448499 -1.088173 -1.223227
H  -4.851629 2.1760 1.509915
H  -5.485084 0.67022 2.211734
H  -4.757706 1.872641 -1.336652
H  -3.667876 0.51221 -1.724962
H  -3.070884 -1.224406 0.17476
H  -3.809721 -1.00234 1.787411
H  -7.908916 -0.245291 -0.219601
H  -7.056381 0.720984 -1.439267
H  -6.797953 2.461518 0.106899
H  -7.564814 1.499973 1.383792
H  -2.34869 2.555783 -1.347426
H  -3.089854 2.818924 0.257126
H  -2.540636 1.118076 2.118681
H  -1.419481 -0.213918 1.688065
H  -0.630622 2.874807 0.87282
H  0.140217 1.276811 1.101287
H  -0.159355 2.689515 -1.632631
H  1.306812 2.656908 -0.629446
H  1.198822 0.892639 -2.55714
H  -0.195915 0.194128 -1.675118
H  3.148157 1.705763 -2.075775
H  0.197907 -1.743836 -2.340137
H  5.383622 -0.050552 2.038612
H  1.903433 -4.011835 1.786953
H  5.399457 2.532505 -1.449063
H  -0.376383 -4.121048 -1.914842
H  0.477408 -5.290107 0.149873
H  6.918487 2.448554 1.63303
H  7.639304 0.970634 0.951656
H  7.40672 2.407691 -0.08141
