program: Gaussian 09
title: 000194875
version: EM64L-G09RevD.01
frameworkgroup: C1[X(C15H22O9S)]
method: RPBEPBE
basis: SDD
operation: Freq
keyword: #p
keyword: freq=noraman
keyword: PBEPBE/SDD
title: #p freq=noraman PBEPBE/SDD
converged: YES YES NO NO
title: Mulliken charges:
elementType: S O O O O O O O O O C C C C C C C C C C C C C C C H H H H H H H H H H H H H H H H H H H H H H
charge: -0.047816 -0.274497 -0.275401 -0.285575 -0.285359 -0.252292 -0.256407 -0.248852 -0.258652 -0.261105 -0.105375 -0.097550 -0.125383 -0.051999 0.055686 -0.358757 -0.819567 0.335610 0.318381 0.329743 -0.768195 -0.765532 0.311132 -0.783179 -0.752688 0.297839 0.298962 0.296522 0.242512 0.241056 0.287970 0.249219 0.287690 0.300905 0.136837 0.273569 0.244268 0.251283 0.275979 0.245761 0.246163 0.244185 0.243522 0.311486 0.256137 0.242855 0.248907
chargesum: 0.00000
title: Mulliken charges with hydrogens summed into heavy atoms:
elementType: S O O O O O O O O O C C C C C C C C C C C C C C C
charge: 0.089022 -0.274497 -0.275401 -0.285575 -0.285359 -0.252292 -0.256407 -0.248852 -0.258652 -0.261105 0.192464 0.201413 0.171139 0.190514 0.296741 0.178432 -0.230972 0.335610 0.318381 0.329743 0.000925 0.002371 0.311132 0.016013 -0.004789
polarizability: 2.33267856e+02 4.90549812e+00 2.11953877e+02 -2.78371739e+00 6.02873687e+00 1.73797344e+02
1716.lowfreq: -8.1487 -4.9303 0.0004 0.0011 0.0012 2.5843 20.8467 32.1672 44.2961
frequency: 20.8332 32.1460 44.2956 48.3321 55.7413 60.0995 64.6914 66.3559 73.0633 75.9485 86.1202 91.2003 98.9919 104.5111 106.5920 110.1098 121.5251 138.3267 147.3896 170.1204 188.8593 197.2345 203.3903 216.5926 248.2891 269.0659 278.8169 286.1736 298.5204 343.1437 384.8491 390.1946 409.2040 416.4498 440.3779 454.6604 477.1148 520.8796 551.7919 558.8204 561.0364 561.9954 570.0805 586.8499 603.8814 618.0654 637.0967 661.4920 696.8690 729.9375 756.4268 788.2823 801.9669 819.5514 845.5107 860.9595 870.3609 910.1139 934.5892 950.5294 964.1951 970.7989 992.7748 996.0224 1002.6322 1003.9773 1013.2032 1030.5463 1042.9974 1043.5499 1045.2193 1053.0911 1055.6440 1070.5391 1110.1640 1132.8502 1166.4007 1171.5466 1181.2302 1189.2291 1197.2368 1209.9160 1239.8116 1244.3618 1253.3865 1257.7147 1268.4700 1288.1103 1300.1090 1308.0364 1321.6843 1335.3771 1359.9451 1365.0410 1377.9547 1383.9918 1384.5131 1386.1083 1395.5528 1451.5522 1451.9741 1452.7495 1453.1089 1453.7532 1454.1048 1454.8151 1454.9482 1461.2299 1466.2638 1642.0680 1652.7972 1656.2695 1661.4435 2380.3231 2960.3003 3001.0395 3005.2694 3005.6326 3008.0742 3025.2249 3033.9688 3041.3598 3046.3702 3049.6546 3053.6084 3087.8624 3100.0223 3100.1016 3101.0240 3126.1802 3127.2891 3142.8916 3143.0154 3143.1168 3143.9119
redmass: 5.6502 6.4134 2.7338 3.5330 2.0524 2.8518 3.8149 4.4495 4.4040 6.9869 3.5902 1.2447 4.0686 2.7881 1.4115 4.7593 3.4234 1.2388 4.5703 6.1289 6.8803 6.2041 8.9682 3.7599 5.4042 4.6241 6.0407 6.0583 3.5000 5.2123 3.4064 3.2864 1.2674 2.4448 3.7077 3.6518 3.6788 4.1825 3.6480 3.2916 3.3207 3.2430 3.7004 5.3624 4.9207 5.2733 4.7090 4.1773 4.0343 3.8382 3.2036 2.2467 4.2326 4.1511 4.5268 2.3472 3.8931 4.0702 3.6344 5.0442 4.1794 3.5052 2.1094 2.1148 2.1881 2.2194 2.3367 3.2888 1.6767 1.6685 1.6561 2.2557 1.6932 3.1263 2.8643 2.0153 1.5026 3.0780 2.2977 2.9288 3.3139 3.4316 1.2102 1.2942 1.1903 1.3684 1.2884 1.2844 1.2592 1.4087 1.3033 1.3219 1.4051 1.4628 1.3121 1.2446 1.2766 1.2484 1.2339 1.0656 1.0581 1.0625 1.0544 1.0552 1.0643 1.0543 1.0541 1.0833 1.0666 8.7031 8.9511 10.0902 9.9708 1.0380 1.0835 1.0371 1.0385 1.0386 1.0376 1.0839 1.0853 1.0843 1.0662 1.0752 1.0584 1.0969 1.0941 1.0953 1.0936 1.1064 1.1087 1.1025 1.1025 1.1020 1.1010
irintensity: 0.0349 0.1374 0.8803 1.3681 1.4371 7.1450 1.8521 0.4905 3.7011 1.7798 4.2827 0.5279 0.5119 1.5405 0.3701 1.9119 5.3478 0.5317 4.3539 0.3982 7.2571 0.4367 3.5617 0.4782 15.7691 6.5884 11.5721 2.8287 20.2933 1.7682 21.7019 2.4090 17.7971 18.5119 19.7404 4.2921 3.4559 13.5216 7.4293 11.4025 4.5214 4.8771 3.7812 2.7443 3.0815 6.0030 3.7409 3.0691 23.9172 4.1305 6.7544 32.9933 7.1275 4.5993 65.5946 13.8157 35.3330 5.7046 65.2328 44.9863 95.6913 33.0167 18.2056 26.1933 195.9770 108.2915 76.4527 54.4017 10.1254 9.4588 15.1501 23.2900 6.5571 31.3715 1.4338 13.0265 10.5130 22.7724 80.7724 304.2387 793.1675 63.3056 29.5544 16.0639 8.5099 13.5155 6.6372 2.7855 3.1722 4.9117 10.0017 7.3458 1.7137 10.8791 26.1156 42.3713 60.8675 73.7611 55.7856 1.5215 23.9989 48.8655 7.0161 12.6111 27.1357 26.2156 9.4122 10.6917 45.5006 290.5585 144.0621 95.8567 198.4080 27.9024 20.1358 14.9348 0.8409 0.3162 1.7796 23.8294 11.7924 8.0178 18.5235 3.9755 11.6236 10.3598 6.9615 9.6801 4.8065 4.5445 0.9510 3.3054 14.5190 5.8706 8.2703
temp: 298.150 k
press: 1.00000 atm
elementType: 16 8 8 8 8 8 8 8 8 8 6 6 6 6 6 6 6 6 6 6 6 6 6 6 6 1 1 1 1 1 1 1 1 1 1 1 1 1 1 1 1 1 1 1 1 1 1
symmnumber: 1
zpe: 943397.0 jmol-1
zpe.correction: 0.359321 hartree
zpe.thermalcorrener: 0.387942 hartree
zpe.thermalcorrenthalpy: 0.388886 hartree
zpe.thermalcorrgfe: 0.297458 hartree
zpe.sumelectzpe: -1657.933882 hartree
zpe.sumelectthermal: -1657.905262 hartree
zpe.sumelectthermalent: -1657.904317 hartree
zpe.sumelectthermalfe: -1657.995745 hartree
dipole: 1.3917 3.4652 1.1692
dipole: 3.9130
quadrupole: -149.6995 -153.1297 -158.3441
quadrupole: -10.7843 -0.4082 -4.0182
quadrupole: 4.0249 0.5947 -4.6196 -10.7843 -0.4082 -4.0182
hfenergy: -1658.2932032 hartree
pointgroup: C01 [X(C15H22O9S1)]
dipole: -0.4774121 1.4508782 -0.1924603 debye
polarizability: 204.0348541|-4.3879566|211.7121335|-21.2753665|-21.9612211|203.2720894 unknown
InChI: InChI=1S/C15H22O9S/c1-7(16)20-5-11-13(21-8(2)17)15(23-10(4)19)14(22-9(3)18)12(6-25)24-11/h11-15,25H,5-6H2,1-4H3
charge 0 multiplicity 1
47 atoms
S  0.52075 -4.631343 0.614827
O  -1.603981 -1.26713 -0.432914
O  2.256273 -0.327447 -1.271829
O  -0.023369 1.928229 -1.612278
O  0.3520 -0.67188 1.761122
O  -3.29074 0.82163 0.7123
O  3.162204 1.81518 -1.040345
O  1.054779 1.574932 -3.65855
O  1.468054 -2.392871 2.877575
O  -2.806718 -0.153312 2.784189
C  1.090094 0.055468 -0.425745
C  -0.073642 0.465073 -1.358062
C  0.76492 -1.191675 0.428356
C  -1.472565 0.167818 -0.771107
C  -0.349947 -2.037848 -0.217255
C  -1.847262 1.048148 0.435245
C  -0.795781 -3.277535 0.567101
C  3.214811 0.671942 -1.542941
C  0.618449 2.363224 -2.79379
C  0.754737 -1.363724 2.916753
C  4.234728 0.159014 -2.526079
C  0.715689 3.866751 -2.802783
C  -3.630106 0.149235 1.891814
C  0.204736 -0.68278 4.143246
C  -5.113025 -0.146522 1.910265
H  1.376449 0.902531 0.223821
H  0.043668 -0.067342 -2.321214
H  1.67422 -1.80999 0.541629
H  -2.223763 0.343405 -1.563189
H  0.049628 -2.366082 -1.202045
H  -1.259777 0.800434 1.332197
H  -1.750984 2.113148 0.170933
H  -1.106009 -3.018724 1.590947
H  -1.656599 -3.725629 0.047216
H  1.263891 -4.044552 1.632734
H  3.832535 0.307323 -3.545668
H  5.170269 0.72972 -2.430144
H  4.418256 -0.9174 -2.386727
H  1.586355 4.157529 -2.186019
H  0.872036 4.227665 -3.829862
H  -0.181419 4.328069 -2.361054
H  0.671871 0.311297 4.263444
H  0.415357 -1.293556 5.032408
H  -0.8806 -0.523173 4.019129
H  -5.318817 -1.004425 1.244785
H  -5.430942 -0.402255 2.931441
H  -5.687517 0.713427 1.530319
