program: Gaussian 09
title: 000194831
version: EM64L-G09RevD.01
frameworkgroup: C1[X(C17H26ClNOS)]
method: RPBEPBE
basis: SDD
operation: Freq
keyword: #p
keyword: freq=noraman
keyword: PBEPBE/SDD
title: #p freq=noraman PBEPBE/SDD
converged: YES YES NO NO
title: Mulliken charges:
elementType: Cl S O N C C C C C C C C C C C C C C C C C H H H H H H H H H H H H H H H H H H H H H H H H H H
charge: -0.070462 0.148625 -0.200044 -0.580114 -0.395549 -0.359643 -0.514163 -0.694465 -0.499361 -0.337257 0.227897 -0.359231 0.748093 -0.606817 -0.696404 -0.364044 -0.364187 -0.342028 -0.226672 -0.246736 -0.240634 0.217324 0.197237 0.228023 0.192677 0.234121 0.214781 0.318625 0.238308 0.265862 0.183362 0.181870 0.202585 0.196002 0.253190 0.262519 0.205554 0.209729 0.216520 0.239174 0.218931 0.222787 0.257663 0.230932 0.235681 0.271903 0.277837
chargesum: 0.00000
title: Mulliken charges with hydrogens summed into heavy atoms:
elementType: Cl S O N C C C C C C C C C C C C C C C C C
charge: -0.070462 0.148625 -0.200044 -0.030374 0.019011 0.061056 -0.065261 -0.375840 0.004810 0.027975 0.227897 0.039356 0.748093 -0.091109 -0.064601 -0.364044 -0.125013 0.099690 0.030991 -0.015804 -0.004953
polarizability: 2.40384355e+02 1.12385383e+01 2.16321343e+02 1.44792907e+01 -7.83539921e+00 1.88271112e+02
1716.lowfreq: -22.0634 -6.9277 -0.0023 -0.0015 0.0016 3.0821 8.6240 12.1232 16.3685
frequency: -21.0802 8.4500 16.1102 23.9131 42.0857 45.7817 48.9874 61.1383 88.3307 99.2300 104.4966 110.1042 115.5225 132.6334 150.1617 162.8957 186.9817 205.3358 227.4851 228.2976 233.6107 255.8032 269.1703 299.6456 312.5865 357.7049 366.5689 382.6122 388.8824 442.3928 449.8852 471.0489 530.3177 551.1173 573.1949 573.8432 597.2164 659.8286 678.9028 691.1122 716.7498 734.2442 746.2326 759.2224 768.8362 776.0032 815.5189 849.6491 859.9269 868.7015 890.4585 930.1445 934.7783 948.8358 953.5061 984.3855 1000.0947 1002.9977 1011.0602 1020.4917 1030.4759 1040.2467 1062.6697 1074.0413 1080.6472 1088.8337 1103.2775 1108.2979 1124.3001 1153.6507 1164.8416 1173.0185 1188.4751 1199.9133 1204.1321 1212.4497 1223.8645 1249.9882 1257.0986 1272.1604 1278.7865 1284.7553 1291.6618 1294.3842 1300.6817 1306.1993 1315.4974 1343.3671 1348.8304 1358.1738 1370.0028 1383.0094 1389.3474 1425.8780 1437.7162 1443.3679 1453.8134 1460.6259 1461.2814 1462.3004 1470.5480 1477.4755 1478.5753 1482.1960 1486.1891 1572.8776 1601.4228 1625.7392 1637.2257 2936.1184 2949.6314 2964.5623 2967.3786 2970.4793 2975.8148 2978.0868 2988.3124 2990.8451 3011.6628 3022.8357 3027.3163 3042.1198 3044.6836 3046.4204 3066.3137 3069.3270 3070.3952 3080.6030 3107.5419 3128.7996 3142.8841 3158.2593 3174.5420 3476.7409 3607.3925
redmass: 1.7395 4.9239 4.6905 4.3947 5.5976 4.6943 4.4580 5.5313 3.7063 2.5658 3.5512 2.1545 2.3939 3.5150 4.5178 4.4733 3.5909 1.1614 1.4726 2.2656 3.3671 3.5778 3.7903 3.1421 3.2096 3.5164 4.0610 6.0728 7.7940 3.0232 3.0006 3.7254 3.2639 3.5627 1.4378 2.6682 3.6537 5.8794 4.2483 4.5681 1.1451 1.7546 1.4225 1.2028 1.5602 3.1824 1.7441 1.6723 2.0886 1.6531 1.8160 1.5388 1.5083 1.3903 1.8077 1.3332 2.6929 2.0466 5.8070 2.5959 2.3797 2.1944 2.4939 2.2967 1.9781 2.1911 1.6695 1.8507 1.6918 1.8294 1.3059 1.1014 1.3921 1.5075 1.5061 1.7093 1.2565 1.3046 1.2943 1.4048 1.4152 1.0690 1.1779 1.1056 1.3430 1.2988 1.4671 1.7118 1.5512 1.5974 1.3574 3.4352 1.2192 2.1341 1.0821 1.1022 1.1073 1.1018 2.1585 1.1005 1.0732 1.0427 1.0788 1.0831 1.0838 6.0568 6.9164 8.5309 1.0949 1.0688 1.0586 1.0601 1.0584 1.0373 1.0615 1.0639 1.0620 1.0968 1.0983 1.1031 1.0602 1.0935 1.0912 1.1037 1.1008 1.1013 1.0991 1.0856 1.1064 1.0856 1.0899 1.0950 1.0993 1.0449 1.0987
irintensity: 0.1047 0.2035 0.2127 0.7753 0.6975 0.1051 0.6306 3.6269 3.6039 1.2081 1.1128 1.3246 1.3004 0.8052 1.3134 2.2669 0.9427 72.3019 0.3418 0.8883 7.9329 1.5080 5.2075 0.9446 3.3948 0.2079 2.5585 15.2371 2.6563 2.3536 1.9151 14.6029 6.6811 4.0047 207.0582 61.9132 1.3778 16.4108 16.4966 16.9261 24.5303 10.0745 36.8266 4.5162 43.4981 3.0248 3.6160 5.9699 0.6014 0.1102 2.9101 1.2633 7.1301 0.6170 15.1154 0.1872 4.3942 4.8240 36.5832 9.7955 13.4852 2.4297 2.6908 0.8862 20.7862 11.3294 7.0246 22.1006 3.7770 2.5738 8.8507 2.7064 0.8142 2.8558 6.7404 20.4451 6.0246 0.6879 7.5681 5.8378 21.4908 0.0680 4.1048 2.8924 27.1041 17.5009 30.5581 18.3580 4.2262 0.5261 8.9859 0.6854 13.6076 16.8376 12.6670 22.1485 14.8871 5.2044 19.2418 6.5807 2.8699 11.6183 6.3833 3.4150 20.6724 7.2277 0.6750 75.2740 36.9463 64.1849 10.4265 11.8897 14.1304 37.8981 76.2524 10.7250 29.4668 6.7669 13.4336 5.0575 20.1890 13.5471 27.1997 81.3642 97.5413 53.4645 46.5144 2.9004 14.5767 2.5272 8.9543 14.5978 11.4152 0.0276 1.8218
temp: 298.150 k
press: 1.00000 atm
elementType: 17 16 8 7 6 6 6 6 6 6 6 6 6 6 6 6 6 6 6 6 6 1 1 1 1 1 1 1 1 1 1 1 1 1 1 1 1 1 1 1 1 1 1 1 1 1 1
symmnumber: 1
zpe: 1034582.0 jmol-1
zpe.correction: 0.394051 hartree
zpe.thermalcorrener: 0.418258 hartree
zpe.thermalcorrenthalpy: 0.419202 hartree
zpe.thermalcorrgfe: 0.335782 hartree
zpe.sumelectzpe: -1649.860350 hartree
zpe.sumelectthermal: -1649.836144 hartree
zpe.sumelectthermalent: -1649.835199 hartree
zpe.sumelectthermalfe: -1649.918619 hartree
dipole: -2.0948 -1.5214 -2.6774
dipole: 3.7245
quadrupole: -142.9695 -129.0178 -149.2711
quadrupole: -9.5225 3.7906 -2.3229
quadrupole: -2.5500 11.4017 -8.8516 -9.5225 3.7906 -2.3229
hfenergy: -1650.2544013 hartree
pointgroup: C01 [X(C17H26Cl1N1O1S1)]
dipole: -0.7637546 0.6601248 1.0621 debye
polarizability: 238.6729547|-12.5234425|214.7653541|-16.8151198|-9.0875076|191.5385012 unknown
InChI: InChI=1S/C17H26ClNOS/c1-2-3-4-5-8-14(20)13-17(21-12-11-19)15-9-6-7-10-16(15)18/h6-7,9-10,17H,2-5,8,11-13,19H2,1H3
charge 0 multiplicity 1
47 atoms
Cl 1.974221 0.647447 -2.596928
S  3.141791 -1.43794 1.111774
O  -0.480179 -2.127882 -1.784189
N  5.591921 1.647742 -0.304285
C  -2.668295 -2.100234 0.785092
C  -3.237591 -0.9572 -0.084074
C  -1.823422 -3.141032 -0.016324
C  1.615453 -1.247936 -0.040173
C  0.630502 -2.360398 0.37769
C  -4.042132 0.073363 0.739701
C  -0.557133 -2.510042 -0.585893
C  -4.59304 1.23436 -0.119447
C  1.010897 0.145132 0.019934
C  4.465046 -0.489609 0.134954
C  -5.379969 2.274965 0.706182
C  1.079281 1.069554 -1.050774
C  0.335894 0.589017 1.19131
C  4.568193 0.995606 0.533712
C  0.491828 2.35008 -0.997618
C  -0.256958 1.863865 1.275925
C  -0.186445 2.748793 0.174271
H  -3.500185 -2.642406 1.277021
H  -2.052778 -1.669133 1.601351
H  -2.412437 -0.437528 -0.608646
H  -3.884158 -1.386913 -0.876584
H  -2.425669 -3.53891 -0.852845
H  -1.55065 -3.976802 0.657875
H  1.970072 -1.459995 -1.061095
H  0.26351 -2.220812 1.41148
H  1.172962 -3.32938 0.379219
H  -4.884059 -0.433519 1.257191
H  -3.39102 0.491443 1.536441
H  -3.74685 1.731194 -0.636551
H  -5.244513 0.821489 -0.916333
H  4.22242 -0.601079 -0.936099
H  5.418499 -1.00682 0.331407
H  -4.739509 2.72625 1.487924
H  -6.246396 1.808401 1.212235
H  -5.762335 3.093361 0.068641
H  0.304949 -0.079937 2.058731
H  4.885237 1.060558 1.59049
H  3.56033 1.462854 0.471039
H  0.566137 3.020166 -1.858967
H  -0.764656 2.171127 2.196523
H  -0.64533 3.741849 0.224032
H  5.30757 1.804913 -1.275162
H  6.047297 2.462876 0.111838
