program: Gaussian 09
title: 000197538
version: EM64L-G09RevD.01
frameworkgroup: C1[X(C16H22N4O4)]
method: RPBEPBE
basis: SDD
operation: Freq
keyword: #p
keyword: freq=noraman
keyword: PBEPBE/SDD
title: #p freq=noraman PBEPBE/SDD
converged: YES YES NO NO
title: Mulliken charges:
elementType: O O O O N N N N C C C C C C C C C C C C C C C C H H H H H H H H H H H H H H H H H H H H H H
charge: -0.191391 -0.194957 -0.300960 -0.343601 -0.264492 -0.386726 -0.419204 -0.608358 -0.221977 -0.579466 -0.365047 -0.575183 0.259475 -0.554795 0.495075 0.206525 0.268715 -0.398190 -0.427026 0.298859 -0.231113 -0.225304 -0.245071 -0.762728 0.285547 0.299756 0.229452 0.216641 0.225992 0.225984 0.202478 0.245296 0.259747 0.271769 0.367440 0.377860 0.237910 0.233191 0.223250 0.221878 0.225445 0.254075 0.254200 0.235397 0.328865 0.344766
chargesum: 0.00000
title: Mulliken charges with hydrogens summed into heavy atoms:
elementType: O O O O N N N N C C C C C C C C C C C C C C C C
charge: -0.191391 -0.194957 -0.300960 -0.343601 0.007277 -0.019286 -0.041344 0.065272 0.063570 -0.050258 0.077587 -0.146721 0.259475 -0.049751 0.495075 0.206525 0.268715 -0.160280 -0.193835 0.298859 -0.007863 -0.003426 -0.019625 -0.019056
polarizability: 2.51762644e+02 -2.02646698e+01 1.98441826e+02 8.09721170e+00 -7.09909553e+00 1.92521994e+02
1716.lowfreq: -7.5891 -2.3113 0.0005 0.0008 0.0010 3.6650 7.9397 10.9731 15.2951
frequency: -0.5591 9.7658 15.1724 32.5733 39.6325 52.5184 54.5129 62.7126 69.5778 80.7430 89.4868 96.9422 127.0157 133.4266 143.0195 177.2586 193.5525 213.0818 228.3986 260.5049 273.8195 287.6654 313.3440 329.7874 340.7467 357.9398 403.1577 428.6754 430.2505 459.0041 507.5377 523.6461 531.4420 545.4691 568.7470 579.5445 600.0036 617.5641 629.7073 634.5278 663.8365 694.6008 704.8049 716.4320 757.8871 763.1352 776.9051 803.2908 815.3852 835.4331 853.5587 866.9318 906.9601 911.3837 933.7683 938.3753 953.1123 974.8567 989.8602 992.1898 1001.2634 1006.1782 1012.4941 1025.7671 1038.7238 1043.6379 1049.5521 1070.6634 1075.1676 1097.4307 1118.9581 1124.0329 1151.7196 1171.1383 1186.4113 1187.6383 1193.3139 1205.8666 1217.3177 1247.6642 1269.4401 1283.3946 1299.6930 1301.1749 1317.9853 1319.6395 1327.1547 1339.9336 1367.8104 1382.1109 1393.8919 1395.1631 1430.9632 1439.5395 1445.7292 1451.0539 1464.5454 1474.0625 1475.6758 1484.3137 1491.4357 1515.7851 1520.6834 1573.3121 1592.5665 1593.5818 1614.5375 1638.7114 1667.3793 1669.9691 2910.8479 2969.4805 2973.8713 2978.3523 3002.7123 3008.5107 3009.7895 3018.9272 3033.6288 3053.9307 3077.7396 3097.9440 3113.6162 3114.5380 3115.8138 3130.5939 3142.1678 3160.6150 3290.0049 3432.4235 3518.2798 3672.3652
redmass: 3.7543 6.0996 5.0766 6.0552 4.1045 5.2957 3.9821 6.6005 2.4711 1.4348 2.9206 3.9022 3.0247 5.5993 5.3545 4.2397 5.9528 3.4491 3.7578 5.6143 6.0497 6.4313 5.4217 3.5982 2.6326 3.7651 2.8180 4.6403 3.5878 2.1224 3.0851 2.5229 2.5839 1.5923 3.0549 4.6941 3.3757 6.3541 1.6734 3.4673 2.0083 2.7323 1.7479 3.8161 2.0292 2.7499 1.4648 1.2165 3.6628 3.2012 1.2464 3.6749 3.1010 1.7750 2.0953 3.7181 4.0020 1.3881 6.1018 1.3146 1.5923 1.5333 1.3947 2.2546 1.9879 2.6140 1.6507 2.3654 2.2182 1.5904 3.4824 3.8248 1.7499 1.0547 1.3991 1.3398 1.8488 2.3547 2.2498 1.3513 1.4189 1.1453 1.4259 1.4535 1.3855 1.4551 1.2541 1.7649 1.3303 8.0400 1.2529 3.3286 1.1025 2.1726 1.1043 1.0494 1.1739 1.1979 1.1339 2.1618 1.0953 2.4072 2.1795 3.9292 6.0427 1.7160 6.1724 1.9753 2.7262 5.4663 1.0676 1.0616 1.0837 1.0642 1.0361 1.0624 1.0893 1.0894 1.0994 1.1004 1.0988 1.0976 1.1016 1.0854 1.0878 1.0913 1.0960 1.1015 1.0825 1.0733 1.0455 1.1042
irintensity: 0.0559 0.6494 0.8281 1.1429 1.0301 5.7086 4.3921 2.1671 0.7315 0.7057 1.2019 10.3661 7.9893 8.2814 9.7375 9.1461 0.1979 32.2287 23.1113 1.4190 0.3355 10.3693 4.5523 5.0241 0.3155 5.7341 0.0290 13.8038 11.4869 3.2628 0.5162 47.2767 35.1060 79.6303 56.5728 24.3027 26.0149 0.1259 71.2911 13.9075 85.1539 54.3115 42.4202 66.7885 34.4689 73.9413 124.9700 0.6822 11.0159 17.9056 0.0175 1.4354 15.1366 8.7753 7.7597 16.8753 3.4764 0.0492 0.0508 0.1482 4.1399 34.9240 53.1093 5.7311 3.2817 3.5822 23.4982 3.1855 4.8162 9.3876 4.4286 66.4041 39.5827 0.2537 11.7215 5.3927 19.8036 357.0740 8.6667 9.2712 14.2232 1.0021 2.9104 14.6982 9.9978 12.2889 0.3726 34.1529 6.7014 0.1614 67.9340 188.1659 29.3257 6.8229 35.8097 14.3026 127.9005 34.0723 4.7792 13.4206 2.7189 598.8234 608.3359 109.4582 1.2630 23.6610 8.7734 218.5227 10.7934 242.5895 52.8072 38.5637 12.4138 29.8015 11.0019 15.4056 11.2498 583.4445 10.5680 29.2881 19.7494 6.6009 13.0435 8.8958 3.6068 14.2982 46.9990 24.0923 369.4155 0.5714 58.8167 32.0805
temp: 298.150 k
press: 1.00000 atm
elementType: 8 8 8 8 7 7 7 7 6 6 6 6 6 6 6 6 6 6 6 6 6 6 6 6 1 1 1 1 1 1 1 1 1 1 1 1 1 1 1 1 1 1 1 1 1 1
symmnumber: 1
zpe: 974283.7 jmol-1
zpe.correction: 0.371085 hartree
zpe.thermalcorrener: 0.395140 hartree
zpe.thermalcorrenthalpy: 0.396084 hartree
zpe.thermalcorrgfe: 0.312739 hartree
zpe.sumelectzpe: -1141.052899 hartree
zpe.sumelectthermal: -1141.028844 hartree
zpe.sumelectthermalent: -1141.027899 hartree
zpe.sumelectthermalfe: -1141.111245 hartree
dipole: 7.0849 1.2241 -1.4444
dipole: 7.3336
quadrupole: -93.3563 -140.5614 -149.5883
quadrupole: -16.3776 -1.5817 2.9737
quadrupole: 34.4791 -12.7261 -21.7530 -16.3776 -1.5817 2.9737
hfenergy: -1141.4239837 hartree
pointgroup: C01 [X(C16H22N4O4)]
dipole: 2.8291335 0.3281492 0.4614635 debye
polarizability: 246.7219824|8.3201296|188.5247406|-25.2042615|-2.390298|207.4797406 unknown
InChI: InChI=1S/C16H22N4O4/c1-11(21)19-13(9-14(17)22)16(24)20-15(23)10-18-8-7-12-5-3-2-4-6-12/h2-6,13,18-20H,7-10,17H2,1H3
charge 0 multiplicity 1
46 atoms
O  2.110656 -0.099108 -2.602724
O  -0.570806 1.057488 -2.263029
O  5.960861 -1.484858 -0.057691
O  2.361027 1.287118 1.688536
N  -2.285773 2.27383 -0.31834
N  3.580692 -0.324938 0.541583
N  1.285783 1.19017 -0.795888
N  7.169993 -0.166511 -1.524098
C  3.63908 0.441073 -0.724805
C  4.701224 -0.150621 -1.689298
C  -2.938207 0.989245 0.030814
C  -4.471979 1.101393 -0.155902
C  2.259872 0.464137 -1.490526
C  -0.834159 2.293694 -0.143055
C  -5.189885 -0.179759 0.239472
C  -0.053479 1.439855 -1.185545
C  5.981737 -0.641024 -1.017505
C  -5.231026 -1.290358 -0.643939
C  -5.800409 -0.308884 1.5135
C  3.027199 0.185759 1.687835
C  -5.863673 -2.49568 -0.265717
C  -6.434948 -1.512729 1.897122
C  -6.468467 -2.611675 1.007975
C  3.230086 -0.616182 2.960435
H  3.88238 1.492983 -0.466884
H  4.237085 -1.011012 -2.208228
H  4.909425 0.5979 -2.472101
H  -2.714957 0.767294 1.092849
H  -2.560393 0.132416 -0.574538
H  -4.829595 1.956678 0.446101
H  -4.677126 1.340054 -1.219427
H  -0.578114 1.957808 0.880389
H  -0.46322 3.335542 -0.231141
H  -2.54156 2.564143 -1.27345
H  4.232327 -1.130667 0.588002
H  1.584912 1.493832 0.166859
H  -4.769175 -1.206305 -1.635925
H  -5.781564 0.542102 2.206081
H  -5.88813 -3.341298 -0.962765
H  -6.905157 -1.591693 2.88424
H  -6.962418 -3.544871 1.301662
H  3.654652 0.043757 3.735935
H  2.251528 -0.967795 3.331276
H  3.894354 -1.48445 2.820045
H  7.204247 0.498009 -2.294856
H  8.043801 -0.514365 -1.127434
