program: Gaussian 09
title: 000194828
version: EM64L-G09RevD.01
frameworkgroup: C1[X(C20H16N2O4)]
method: RPBEPBE
basis: SDD
operation: Freq
keyword: #p
keyword: freq=noraman
keyword: PBEPBE/SDD
title: #p freq=noraman PBEPBE/SDD
converged: YES YES NO NO
title: Mulliken charges:
elementType: O O O O N N C C C C C C C C C C C C C C C C C C C C H H H H H H H H H H H H H H H H
charge: -0.292129 -0.434233 -0.433344 -0.280828 -0.389538 -0.502088 -0.522231 0.365436 0.381078 0.444281 0.138188 0.150131 0.080489 -0.368171 -0.377085 -0.372789 -0.559114 -0.559179 -0.389071 -0.387009 0.315617 0.311489 -0.375456 -0.236052 0.091305 -0.255163 0.291197 0.296173 0.233791 0.249544 0.249696 0.251991 0.250693 0.251582 0.253552 0.231951 0.233835 0.338137 0.353708 0.356004 0.307680 0.305930
chargesum: 0.00000
title: Mulliken charges with hydrogens summed into heavy atoms:
elementType: O O O O N N C C C C C C C C C C C C C C C C C C C C
charge: -0.292129 -0.080525 -0.077340 -0.280828 -0.051401 0.111523 -0.231034 0.365436 0.381078 0.444281 0.138188 0.150131 0.080489 -0.071997 -0.143294 -0.123244 -0.309418 -0.307188 -0.138377 -0.135427 0.315617 0.311489 -0.121904 -0.004101 0.091305 -0.021328
polarizability: 2.85109488e+02 -2.24983333e+00 2.74613731e+02 -1.54790546e+01 -2.87558845e+00 1.83062490e+02
1716.lowfreq: -8.6392 -5.9887 -0.0003 0.0001 0.0003 3.3003 25.8317 28.5296 39.5506
frequency: 25.7649 28.4747 39.5221 50.5404 63.4985 89.9449 102.3449 107.9575 118.5408 157.4574 161.8595 184.4271 199.3797 206.3998 262.5518 273.8545 294.7984 300.3433 312.7542 334.3143 350.4346 353.4981 355.8282 365.9280 389.9765 410.5531 449.0055 454.3969 460.3663 467.5843 524.5444 555.6954 565.3066 585.2300 587.8790 589.1957 606.5662 619.3678 637.9395 662.1139 703.5170 712.2372 715.2473 734.0620 739.6925 760.6472 767.0017 785.4033 798.2281 818.6736 828.5785 833.0034 835.2065 844.6381 851.4533 868.7811 890.9388 924.0106 947.9810 960.1421 974.5339 986.8268 994.6026 1037.7789 1048.5839 1084.3510 1091.5310 1107.9445 1130.3967 1130.6741 1157.5447 1168.7697 1175.1028 1179.7122 1190.0818 1196.3341 1200.7717 1214.5843 1244.0810 1256.4058 1280.0888 1283.2663 1288.9011 1301.4026 1310.1094 1313.3791 1378.2463 1395.9011 1398.9109 1426.9823 1428.0911 1434.4705 1439.2851 1476.7828 1493.5055 1504.3883 1571.2519 1584.8373 1588.9619 1607.1610 1610.0256 1624.1991 1643.8008 1679.3295 3041.1208 3125.1360 3126.6842 3132.6178 3140.4408 3141.4683 3142.6087 3146.9013 3165.4336 3176.6852 3178.5661 3390.9635 3506.2224 3550.2188 3582.6634 3583.9105
redmass: 5.7704 5.3949 6.2400 6.9032 7.0017 4.3763 4.5666 4.6227 1.4890 3.6607 4.9294 4.3305 4.1399 5.7008 7.0557 4.8106 5.6604 4.9400 6.4747 6.6734 1.5869 1.8097 1.3020 5.7498 4.3617 4.4940 2.9358 4.4489 3.7149 3.8788 4.8837 4.1121 6.0221 1.2041 8.7862 6.6609 4.2314 6.0349 4.5792 5.0154 3.6914 3.4344 4.9277 5.4226 6.1691 2.0786 1.7528 2.1618 1.9584 1.5230 2.3581 1.7354 3.5464 2.0545 2.1488 6.5009 1.7420 5.1834 1.3631 1.4052 3.3308 1.3141 1.3445 4.7100 2.4063 2.4707 2.0390 2.3290 1.7967 1.5713 1.2207 1.4959 1.8731 1.1961 2.5761 1.9396 2.6013 1.3678 1.5234 2.4096 2.0628 1.1989 5.1463 1.9360 1.4450 1.4683 5.7731 6.1962 6.3378 3.3855 2.1003 1.7670 3.9968 2.4795 3.0922 3.1294 6.5534 7.3739 6.7394 6.5631 6.7455 7.1774 7.6140 1.0616 1.0835 1.0860 1.0900 1.0886 1.0913 1.0920 1.0920 1.0940 1.1008 1.0951 1.0950 1.0429 1.0986 1.0796 1.0660 1.0661
irintensity: 0.3538 0.5044 1.0636 0.4735 0.7927 0.7725 6.4707 0.4661 13.1653 5.3756 0.5927 2.8035 5.7145 1.8364 1.2476 10.8822 9.9662 16.1581 6.8829 3.6226 20.3911 109.0873 141.0850 3.9285 9.1672 12.0493 3.6256 12.6996 25.1660 27.5706 6.7533 14.1783 9.7247 141.0899 2.1638 1.2872 2.1740 7.3601 16.2930 10.8887 1.2859 10.1830 11.8977 1.1443 0.3549 23.6028 145.5586 27.0648 16.1931 2.6410 41.8234 10.2707 34.9752 43.0118 10.6044 25.5450 2.4823 8.3509 0.1351 1.8370 73.1543 0.8544 0.1725 7.5080 5.5086 14.8646 84.4676 3.7983 644.3945 128.8607 35.2672 42.5638 4.7549 1.0398 4.1948 3.1615 5.6461 3.0860 25.8922 32.5187 67.3334 3.0013 52.4839 7.6752 11.3361 38.5797 1.7190 3.0660 26.9471 24.3289 37.8831 155.1637 19.3655 54.9855 344.7725 19.5933 50.1065 53.8155 175.5447 20.1364 18.4575 148.4156 74.4358 29.9469 3.6895 3.5234 10.7218 3.4739 2.0349 2.9618 10.1923 19.2096 25.5391 7.6618 5.0498 0.7464 2.2281 39.5908 44.0928 48.0326
temp: 298.150 k
press: 1.00000 atm
elementType: 8 8 8 8 7 7 6 6 6 6 6 6 6 6 6 6 6 6 6 6 6 6 6 6 6 6 1 1 1 1 1 1 1 1 1 1 1 1 1 1 1 1
symmnumber: 1
zpe: 833744.0 jmol-1
zpe.correction: 0.317556 hartree
zpe.thermalcorrener: 0.339933 hartree
zpe.thermalcorrenthalpy: 0.340878 hartree
zpe.thermalcorrgfe: 0.265299 hartree
zpe.sumelectzpe: -1180.296125 hartree
zpe.sumelectthermal: -1180.273747 hartree
zpe.sumelectthermalent: -1180.272803 hartree
zpe.sumelectthermalfe: -1180.348382 hartree
dipole: -0.1066 -1.5413 2.3678
dipole: 2.8272
quadrupole: -117.3922 -161.4245 -145.2980
quadrupole: -3.5910 -2.8986 0.6964
quadrupole: 23.9794 -20.0530 -3.9264 -3.5910 -2.8986 0.6964
hfenergy: -1180.6136809 hartree
pointgroup: C01 [X(C20H16N2O4)]
dipole: -0.2807839 0.3974746 1.0002195 debye
polarizability: 282.5891217|-1.7900208|268.6771151|20.155191|24.2412516|191.5194721 unknown
InChI: InChI=1S/C20H16N2O4/c21-22-20(25)14-4-2-1-3-13(14)19-15-7-5-11(23)9-17(15)26-18-10-12(24)6-8-16(18)19/h1-10,19,22-24H,21H2
charge 0 multiplicity 1
42 atoms
O  2.570356 0.967661 0.62317
O  4.510449 -3.363314 -0.417346
O  1.270987 5.645642 0.722262
O  -2.007271 -1.605232 -2.100448
N  -4.090758 -0.8175 -1.459136
N  -4.681504 -1.005428 -2.737161
C  -0.076987 0.151292 -0.462085
C  1.161663 -0.748876 -0.489022
C  0.313274 1.602487 -0.182597
C  -1.088608 -0.358163 0.592178
C  2.387411 -0.328779 0.073029
C  1.575533 1.937747 0.35832
C  -2.34719 -0.93466 0.24734
C  1.11098 -2.053523 -1.042483
C  -0.590739 2.668098 -0.417643
C  -0.762056 -0.231819 1.966361
C  3.523716 -1.16275 0.119901
C  1.933962 3.265674 0.674029
C  2.22567 -2.910809 -1.01602
C  -0.26972 4.004084 -0.117736
C  3.43034 -2.462061 -0.423073
C  0.999996 4.296103 0.43688
C  -3.23045 -1.372599 1.274804
C  -1.638218 -0.669848 2.978928
C  -2.765125 -1.14794 -1.184679
C  -2.88207 -1.247263 2.633489
H  -0.559044 0.092154 -1.452574
H  0.169499 -2.383006 -1.496075
H  -1.577314 2.436963 -0.836806
H  0.195123 0.224491 2.242409
H  4.449213 -0.778004 0.56291
H  2.930599 3.462676 1.084883
H  2.184684 -3.917441 -1.440534
H  -0.972575 4.821385 -0.298861
H  -4.17707 -1.854002 1.002928
H  -1.353144 -0.566017 4.031602
H  -3.565166 -1.603812 3.411675
H  -4.67787 -0.356779 -0.762147
H  5.303319 -2.961727 0.016936
H  2.178465 5.752227 1.101291
H  -4.156291 -0.484055 -3.454413
H  -4.705071 -2.007179 -2.976186
