program: Gaussian 09
title: 000194789
version: EM64L-G09RevD.01
frameworkgroup: C1[X(C8H16N2O3)]
method: RPBEPBE
basis: SDD
operation: Freq
keyword: #p
keyword: freq=noraman
keyword: PBEPBE/SDD
title: #p freq=noraman PBEPBE/SDD
converged: YES YES NO NO
title: Mulliken charges:
elementType: O O O N N C C C C C C C C H H H H H H H H H H H H H H H H
charge: -0.274727 -0.420119 -0.228319 -0.559908 -0.376264 -0.352807 -0.386646 -0.211521 -0.533886 0.249252 0.132955 -0.336579 -0.653266 0.224922 0.210386 0.242648 0.219695 0.257106 0.202890 0.233652 0.286776 0.276902 0.292666 0.212666 0.259079 0.237269 0.200926 0.218716 0.375537
chargesum: 0.00000
title: Mulliken charges with hydrogens summed into heavy atoms:
elementType: O O O N N C C C C C C C C
charge: -0.274727 -0.044582 -0.228319 0.003770 -0.083598 0.082501 0.075696 0.045586 -0.097344 0.249252 0.132955 0.135165 0.003644
polarizability: 1.28016567e+02 -7.06014803e+00 1.01289350e+02 6.00554386e-01 -5.25837064e+00 1.01943271e+02
1716.lowfreq: -13.2425 -4.1051 -0.0010 -0.0006 -0.0003 8.1987 11.7604 23.4954 32.6254
frequency: 11.5345 23.3748 32.4924 40.7643 64.5164 75.4720 111.8126 138.1311 173.8546 190.8736 217.6744 239.5712 279.3200 301.1629 327.2653 365.0004 415.6858 442.5050 493.7259 558.5739 569.9144 599.3646 626.9842 669.0319 687.6521 719.6820 742.0656 771.0202 786.7156 856.0070 881.2392 915.8587 941.1609 1017.8943 1022.7384 1048.8266 1067.3002 1078.7215 1104.4009 1132.3328 1146.9617 1155.4915 1195.8955 1215.8738 1235.0437 1265.4387 1273.4219 1281.3675 1303.6037 1306.7607 1341.6241 1356.0449 1358.4051 1366.1879 1388.6611 1443.9779 1452.3178 1463.9065 1472.2022 1479.3599 1480.6135 1492.2130 1619.1255 1653.5929 1658.8773 2969.7753 2981.0351 2983.1919 2991.5687 2995.4862 3021.4409 3022.8290 3046.5695 3064.2160 3070.7213 3083.1995 3096.8313 3462.5193 3499.4168 3548.7962 3580.4982
redmass: 3.6010 4.7196 5.4470 4.4985 3.8119 4.1455 2.0076 3.2314 2.6304 1.1734 1.6572 2.3913 3.1690 2.6709 2.8985 3.4995 3.2805 2.6723 2.7354 1.4331 2.0945 2.4469 1.5917 1.7178 3.5051 3.4444 1.3344 2.1367 1.4826 1.7477 2.1594 2.7266 2.9766 2.9499 2.5765 2.6540 2.0176 2.4067 1.9096 1.4950 1.7754 1.5313 2.1512 1.6501 1.5024 1.5106 1.4013 1.1492 1.3671 1.1880 1.3987 1.3490 1.3838 1.5601 1.2180 1.1014 1.0793 1.1313 1.0608 1.0930 1.0753 1.6834 6.2787 1.5634 2.5614 1.0589 1.0363 1.0631 1.0658 1.0607 1.0842 1.0964 1.1012 1.0977 1.1037 1.0974 1.1015 1.0456 1.0641 1.0773 1.0966
irintensity: 2.2037 0.2661 1.8479 5.9221 0.0348 3.5936 0.3707 4.3957 11.9105 61.4327 3.2586 8.0640 0.7196 2.2066 32.9057 11.2259 18.9945 9.8444 16.1040 87.6393 71.4501 19.6210 81.4156 236.2325 0.3985 10.3820 24.4267 9.1917 6.7014 4.1200 1.1739 5.7698 8.1895 116.8402 123.0675 11.9830 8.4828 2.1381 9.9537 2.1412 13.9467 20.8818 17.7437 48.2421 19.8385 29.3458 16.4874 46.8441 14.9390 0.6461 5.6000 4.3954 1.0213 2.9646 16.9917 7.4455 7.8604 61.3839 22.6216 11.6056 12.2130 166.6841 146.1936 13.3755 250.7855 15.9028 28.8197 12.7196 52.1407 34.9141 27.0452 13.2950 1.1575 11.3186 48.9575 36.7631 34.7209 1.4605 10.7937 12.5301 2.9207
temp: 298.150 k
press: 1.00000 atm
elementType: 8 8 8 7 7 6 6 6 6 6 6 6 6 1 1 1 1 1 1 1 1 1 1 1 1 1 1 1 1
symmnumber: 1
zpe: 637413.9 jmol-1
zpe.correction: 0.242778 hartree
zpe.thermalcorrener: 0.258655 hartree
zpe.thermalcorrenthalpy: 0.259599 hartree
zpe.thermalcorrgfe: 0.195591 hartree
zpe.sumelectzpe: -648.594149 hartree
zpe.sumelectthermal: -648.578272 hartree
zpe.sumelectthermalent: -648.577328 hartree
zpe.sumelectthermalfe: -648.641336 hartree
dipole: -0.8607 2.5860 -3.8813
dipole: 4.7426
quadrupole: -65.5892 -80.4646 -81.5891
quadrupole: -4.8930 4.7893 -1.1351
quadrupole: 10.2917 -4.5836 -5.7081 -4.8930 4.7893 -1.1351
hfenergy: -648.8369271 hartree
pointgroup: C01 [X(C8H16N2O3)]
dipole: 0.3519476 0.012246 -1.832355 debye
polarizability: 127.9495367|-5.8726756|96.737899|-4.290772|1.6443558|106.5617519 unknown
InChI: InChI=1S/C8H16N2O3/c1-2-10-7(11)5-3-4-6(9)8(12)13/h6,10,12H,2-5,9H2,1H3
charge 0 multiplicity 1
29 atoms
O  2.214434 0.529929 1.669379
O  -3.321748 -0.784149 -1.671701
O  -3.116977 -1.775939 0.418429
N  -3.103922 0.849494 1.672918
N  3.244688 0.400044 -0.415835
C  -1.636707 1.306404 -0.295976
C  -0.381865 0.608969 0.27212
C  -2.982976 0.715582 0.220579
C  0.916399 1.221382 -0.301127
C  2.165789 0.6833 0.409868
C  -3.13968 -0.738282 -0.277928
C  4.530564 -0.105535 0.09654
C  4.798979 -1.570778 -0.307138
H  -1.629109 2.373593 -0.004349
H  -1.634809 1.254796 -1.401563
H  -0.337176 0.709797 1.37198
H  -0.40524 -0.476142 0.048443
H  -3.794563 1.297052 -0.256372
H  0.974567 1.055007 -1.395358
H  0.892661 2.318929 -0.14287
H  -2.399323 0.317811 2.194451
H  -4.045046 0.659794 2.031054
H  3.131783 0.511931 -1.424906
H  5.349746 0.548035 -0.261855
H  4.476926 -0.013308 1.19475
H  4.008263 -2.23165 0.088118
H  4.835786 -1.690897 -1.406292
H  5.769025 -1.907824 0.102044
H  -3.418969 -1.732547 -1.960502
