program: Gaussian 09
title: 000197532
version: EM64L-G09RevD.01
frameworkgroup: C1[X(C18H27N3O6)]
method: RPBEPBE
basis: SDD
operation: Freq
keyword: #p
keyword: freq=noraman
keyword: PBEPBE/SDD
title: #p freq=noraman PBEPBE/SDD
converged: NO YES NO NO
title: Mulliken charges:
elementType: O O O O O O N N N C C C C C C C C C C C C C C C C C C H H H H H H H H H H H H H H H H H H H H H H H H H H H
charge: -0.407346 -0.227497 -0.429728 -0.240784 -0.411527 -0.230545 -0.012201 -0.626166 -0.636210 -0.151382 -0.612902 -0.125709 -0.476485 0.260395 0.205725 -0.468073 -0.257530 -0.518683 -0.523614 -0.384496 -0.422028 -0.369370 0.179230 -0.158697 -0.226117 0.146658 0.158140 0.257257 0.226279 0.234991 0.211485 0.227196 0.242437 0.222112 0.256929 0.196624 0.235737 0.198319 0.235958 0.198946 0.244855 0.200083 0.232700 0.226552 0.231543 0.246116 0.259490 0.264121 0.382310 0.372318 0.290352 0.314394 0.376273 0.381566
chargesum: 0.00000
title: Mulliken charges with hydrogens summed into heavy atoms:
elementType: O O O O O O N N N C C C C C C C C C C C C C C C C C C
charge: -0.035028 -0.227497 -0.053456 -0.240784 -0.029961 -0.230545 -0.012201 0.020265 -0.031465 0.105875 -0.151632 -0.125709 -0.037803 0.260395 0.205725 -0.003523 -0.000601 -0.086322 -0.089337 0.059305 0.010754 0.088725 0.179230 0.087419 0.033373 0.146658 0.158140
polarizability: 2.68177227e+02 -3.58729854e+01 2.53177766e+02 -2.57470605e+00 -1.63676390e+00 1.92783437e+02
1716.lowfreq: -7.3870 -4.4256 0.0002 0.0008 0.0009 6.3138 12.1915 21.3216 25.1871
frequency: 11.6117 21.2960 25.0695 30.8566 37.5378 40.7000 47.2336 53.3527 63.0558 76.7296 89.3138 101.0867 106.3038 141.4008 159.1165 167.5060 182.3603 207.6672 208.0818 233.9612 244.9414 259.7110 274.4425 292.6163 294.8869 304.1793 318.1378 331.3320 339.8938 348.3921 361.0662 405.8677 422.6538 452.4673 479.4772 496.1490 510.0284 529.4379 538.8182 549.1314 578.1117 583.3637 597.8102 603.7248 609.8428 626.5722 631.1985 644.4194 688.5381 713.4748 715.2115 725.9273 730.9871 750.8383 765.3308 778.4955 784.1162 804.5500 826.4331 852.3183 864.9611 874.2425 904.9107 915.2620 924.9543 929.0680 938.8309 944.6644 982.6675 1015.7138 1028.2947 1035.4112 1041.6923 1043.3739 1047.2828 1050.5050 1059.5823 1083.1420 1084.6304 1095.7203 1111.1145 1121.8503 1140.9534 1142.1867 1151.2677 1154.1552 1177.1042 1179.9922 1194.4829 1207.2033 1219.3554 1230.1514 1234.0718 1253.2335 1260.0517 1264.2130 1276.5615 1280.9400 1285.5050 1288.4468 1297.9286 1300.7197 1303.4862 1315.2310 1321.4552 1326.0188 1334.7610 1338.3965 1344.6062 1356.3462 1360.0583 1373.1131 1374.5351 1380.0256 1449.5272 1454.8596 1456.0349 1463.9109 1464.9031 1469.0039 1470.8863 1478.3333 1612.5989 1641.0481 1643.0241 1653.9022 1659.2130 1664.8465 1675.4870 2960.1136 2963.6924 2971.8257 2982.2709 2987.1297 2990.9478 2994.0755 2994.7665 3002.1651 3009.4366 3022.5465 3031.5399 3033.2346 3038.6553 3044.5784 3053.1359 3053.8348 3060.2269 3061.8803 3075.2132 3186.1214 3412.6197 3501.4936 3507.0645 3507.7102 3521.6054 3527.2949
redmass: 7.7195 7.8475 7.5948 8.2127 5.6697 6.7676 7.1740 9.0181 5.1874 5.6033 3.5961 4.9689 4.0606 4.2014 2.9577 3.8808 2.5362 3.8706 2.8634 2.9061 3.2448 2.6463 2.7379 2.4781 3.5043 1.7048 2.7419 3.8439 5.1298 2.7729 3.2473 3.3623 3.8422 3.0727 1.8536 3.2829 3.2560 2.5106 4.1206 1.9080 2.4187 2.7433 1.3568 2.4935 2.8280 2.1641 1.8030 2.3040 3.7851 4.2842 1.9914 2.4461 4.6008 2.9590 2.6192 2.5480 2.8422 1.4645 2.3911 2.2186 1.8957 1.6132 2.4082 3.7618 1.9864 2.0654 2.6014 2.1250 2.4059 3.8322 2.5767 2.0558 2.4370 2.1635 2.9338 2.5008 1.8591 2.7403 2.0699 1.9200 2.0917 2.0297 1.9696 1.6357 1.6028 1.4223 1.4239 1.7173 1.4284 1.3458 1.3997 1.4113 1.5067 1.4039 1.4062 1.4691 1.4567 1.5066 1.5018 1.4435 1.2404 1.4234 1.1708 1.5444 1.3980 1.5383 1.4171 1.5073 1.4763 1.6615 1.3966 1.5313 2.9469 1.3479 1.1302 1.1004 1.0873 1.0872 1.0917 1.0841 1.0916 1.0999 9.5071 8.5442 5.9439 5.3042 1.2563 8.4756 1.0798 1.0673 1.0780 1.0641 1.0619 1.0588 1.0618 1.0610 1.0607 1.0605 1.0847 1.0968 1.0844 1.0879 1.0972 1.1008 1.0996 1.0981 1.1031 1.0974 1.1041 1.0668 1.0476 1.0637 1.0641 1.0641 1.0825 1.0933
irintensity: 0.5670 0.0209 0.2894 2.1295 1.0105 0.8260 0.1373 2.6046 0.4149 2.7924 1.2865 0.1210 4.3122 4.9327 1.3942 0.6849 1.8050 0.1097 2.9828 5.5466 1.6653 3.9580 3.5324 6.5409 3.5058 32.4217 7.3905 1.7608 3.7503 4.7353 6.4409 4.0556 21.1605 5.4446 36.4056 7.1731 11.0588 20.4949 36.6031 39.4447 90.4851 29.6078 81.0620 105.0734 26.8579 65.3483 7.9307 50.5787 48.0411 19.7832 26.1544 28.3417 16.7578 18.0659 5.7005 28.2468 2.3406 60.4393 1.0595 61.5912 38.4623 335.6627 3.9544 10.9961 16.2497 17.7769 25.3346 8.6863 103.0472 3.6867 15.1868 3.2860 202.3877 21.0309 98.5959 21.6047 254.0275 15.4454 15.5385 64.1277 13.2095 3.5723 7.5695 11.5303 18.5539 8.9905 6.2586 4.5833 2.5400 5.7250 4.1893 0.2170 4.7628 3.3230 3.9360 3.3987 22.6388 12.5788 18.2012 5.0576 25.7645 5.3892 6.9514 15.3576 8.7981 5.8442 8.7768 4.2031 4.2621 5.2733 0.3075 5.3462 22.9298 3.8580 3.2091 0.5790 1.9770 16.6794 20.1617 12.4666 9.2746 14.0265 171.9670 5.7004 116.1912 243.9260 25.7794 216.0986 44.3948 22.1570 4.1188 38.9350 45.0769 10.5240 47.7827 25.7497 0.7053 45.7194 8.9328 22.9546 25.7339 0.7033 7.6722 41.3668 10.3696 10.6784 38.9375 32.1151 51.5924 443.7099 2.9913 17.7521 18.5441 19.2796 20.4872 7.0224
temp: 298.150 k
press: 1.00000 atm
elementType: 8 8 8 8 8 8 7 7 7 6 6 6 6 6 6 6 6 6 6 6 6 6 6 6 6 6 6 1 1 1 1 1 1 1 1 1 1 1 1 1 1 1 1 1 1 1 1 1 1 1 1 1 1 1
symmnumber: 1
zpe: 1162090.3 jmol-1
zpe.correction: 0.442617 hartree
zpe.thermalcorrener: 0.470646 hartree
zpe.thermalcorrenthalpy: 0.471590 hartree
zpe.thermalcorrgfe: 0.380039 hartree
zpe.sumelectzpe: -1315.638993 hartree
zpe.sumelectthermal: -1315.610964 hartree
zpe.sumelectthermalent: -1315.610020 hartree
zpe.sumelectthermalfe: -1315.701571 hartree
dipole: 1.6836 -0.8530 -2.2472
dipole: 2.9346
quadrupole: -138.5829 -135.3659 -176.1220
quadrupole: 3.2968 -4.3109 -4.9148
quadrupole: 11.4407 14.6577 -26.0984 3.2968 -4.3109 -4.9148
hfenergy: -1316.0816098 hartree
pointgroup: C01 [X(C18H27N3O6)]
dipole: -0.6603091 -0.3121812 -0.8941813 debye
polarizability: 296.2532143|7.6544598|225.1080971|5.2755953|0.4081293|192.7771188 unknown
InChI: InChI=1S/C18H27N3O6/c19-12(16(22)23)3-1-2-11-9(4-6-13(20)17(24)25)8-10-5-7-14(18(26)27)21-15(10)11/h10,12-14,22,24,26H,1-8,19-20H2
charge 0 multiplicity 1
54 atoms
O  5.176679 2.52732 -0.076015
O  3.911969 2.203174 1.841977
O  -5.330469 -1.631339 0.840632
O  -3.650035 -1.761867 2.440041
O  2.979721 -4.301212 0.192927
O  1.741427 -3.626399 2.039446
N  2.069262 1.96113 -0.703793
N  -2.805372 -2.126323 -0.773597
N  -0.693521 -3.881942 0.584498
C  -0.092164 3.027149 0.15278
C  -1.490184 2.832436 -0.494511
C  0.768611 1.962429 -0.54267
C  0.609648 4.394068 0.06535
C  -1.425451 1.434208 -1.118551
C  -0.132496 0.954853 -1.143872
C  2.046394 4.213135 0.616204
C  2.837449 3.14442 -0.193232
C  0.374539 -0.345202 -1.716415
C  -2.660529 0.776611 -1.687167
C  0.636147 -1.410464 -0.611993
C  -3.651355 0.233307 -0.615949
C  0.743947 -2.832347 -1.200594
C  3.983341 2.582714 0.653616
C  -3.084349 -0.995564 0.135154
C  0.598268 -3.968552 -0.141078
C  -3.998269 -1.460925 1.274663
C  1.787061 -3.94565 0.831081
H  -0.165097 2.742101 1.22376
H  -2.317464 2.935017 0.233259
H  -1.671103 3.589338 -1.28663
H  0.636208 4.738813 -0.98794
H  0.072316 5.162769 0.651102
H  1.98848 3.89192 1.673693
H  2.602338 5.168801 0.590747
H  3.297362 3.604826 -1.088192
H  -0.362843 -0.758919 -2.429068
H  1.315989 -0.153473 -2.265385
H  -3.207876 1.517409 -2.305738
H  -2.384991 -0.069922 -2.340403
H  -0.206534 -1.381029 0.101728
H  1.547333 -1.139964 -0.044677
H  -3.898945 1.025779 0.117759
H  -4.59911 -0.052672 -1.109482
H  -0.078311 -2.980831 -1.925702
H  1.700911 -2.965352 -1.739062
H  -2.133721 -0.707339 0.618195
H  0.640426 -4.929161 -0.687124
H  -3.653471 -2.537166 -1.179707
H  -2.133657 -2.824675 -0.388914
H  5.887755 2.119945 0.490842
H  -1.047488 -4.806609 0.859183
H  -0.609896 -3.293577 1.427296
H  -5.865628 -2.016322 1.586761
H  3.736546 -4.233173 0.836763
