program: Gaussian 09
title: 000207146
version: EM64L-G09RevD.01
frameworkgroup: C1[X(C12H14N2O4)]
method: RPBEPBE
basis: SDD
operation: Freq
keyword: #p
keyword: freq=noraman
keyword: PBEPBE/SDD
title: #p freq=noraman PBEPBE/SDD
converged: YES YES NO NO
title: Mulliken charges:
elementType: O O O O N N C C C C C C C C C C C C H H H H H H H H H H H H H H
charge: -0.254256 -0.285344 -0.238017 -0.291412 -0.284918 -0.613470 -0.070439 -0.432120 -0.333041 0.430879 0.240640 -0.492999 -0.364477 0.471651 -0.211838 -0.449819 -0.815557 0.311314 0.253427 0.301937 0.242953 0.260052 0.244301 0.245435 0.300273 0.225314 0.232908 0.224904 0.232027 0.229956 0.343522 0.346215
chargesum: 0.00000
title: Mulliken charges with hydrogens summed into heavy atoms:
elementType: O O O O N N C C C C C C C C C C C C
charge: -0.254256 -0.285344 -0.238017 -0.291412 -0.284918 0.076267 0.182988 0.112770 0.171312 0.430879 0.240640 -0.247564 -0.064204 0.471651 0.013476 -0.216911 -0.128670 0.311314
polarizability: 2.02135881e+02 7.25484594e+00 1.75931219e+02 -1.99060121e+01 1.12659794e+01 8.87727828e+01
1716.lowfreq: -17.2933 -5.1760 -0.0003 -0.0002 0.0006 4.0693 6.5215 17.1848 27.7497
frequency: -16.7482 16.6255 27.6134 36.9095 65.1841 95.3980 96.7662 128.6597 161.0781 209.3640 231.9647 269.0834 275.5205 284.3147 313.0123 339.7417 407.9656 421.0150 440.6425 480.5292 518.5802 519.3642 531.4983 553.5918 570.2501 612.3899 652.2410 673.5199 697.1772 702.8771 708.9560 745.9955 790.7734 797.5892 816.9334 863.1332 872.0217 913.9689 942.7167 949.1407 968.8062 987.6779 992.1576 1006.2125 1019.7345 1048.0674 1060.0851 1068.2690 1096.9890 1105.9769 1124.3508 1187.0444 1191.8533 1210.9190 1214.8277 1247.2301 1277.5854 1305.7048 1315.0721 1322.8223 1346.2400 1367.9170 1380.5474 1386.7909 1397.6147 1441.9254 1451.8631 1471.4082 1478.3952 1490.7253 1505.5115 1589.8387 1596.9432 1618.3682 1687.4368 1699.6385 2976.3689 2986.9880 3032.4820 3054.6061 3060.5631 3071.6668 3086.2159 3121.7301 3127.5757 3144.0143 3151.2923 3192.3139 3556.1186 3712.6318
redmass: 1.0293 4.5839 6.1757 5.0485 5.8936 4.6338 6.5974 5.6235 4.3766 3.0041 4.1646 5.2318 5.0831 4.6539 4.7748 4.3060 3.4876 2.5747 2.7807 3.5162 1.1112 4.9115 1.1316 5.4251 3.9801 5.1306 7.5781 11.4029 2.1989 11.1320 8.0034 6.2720 4.4294 1.3803 5.8849 1.4699 2.6444 1.3750 2.5056 1.7488 6.6041 6.0140 1.3244 1.7241 5.7252 1.5553 2.0249 3.0084 2.1556 1.5719 2.1140 2.4767 1.2536 1.5029 1.7729 1.1548 1.2942 2.3046 2.7310 1.3114 1.6312 2.2756 1.5827 2.9357 1.2706 2.4896 1.1075 1.0494 1.3413 1.9786 1.1291 1.2175 5.8752 6.0054 7.0204 11.5908 1.0374 1.0625 1.0612 1.0975 1.0957 1.0946 1.0986 1.1063 1.0872 1.0908 1.0958 1.0948 1.0448 1.1059
irintensity: 0.4305 0.0764 5.1177 0.3551 0.2711 11.7024 0.9075 1.1086 3.0215 3.2783 11.5336 8.8050 8.8685 2.7247 11.2135 2.6504 0.9303 1.2498 5.6260 9.2888 140.7980 1.5152 178.9537 8.0344 0.1624 2.5430 18.5836 11.3323 18.1245 40.8596 1.9103 9.8866 8.7844 64.0581 32.4656 13.9737 14.4184 6.1653 50.1711 43.7765 79.9161 11.3752 2.3072 46.8551 125.7182 12.7511 20.9791 62.5237 66.2241 31.5054 14.2582 76.6675 10.1578 1.3110 110.1081 46.9735 11.8203 257.7294 134.6388 1.9113 59.2606 67.3283 41.8860 5.2558 14.0263 31.5811 21.8972 14.0054 10.3238 148.1017 11.4527 84.2594 24.2328 109.4887 471.2346 390.6985 34.2292 25.3907 10.4282 20.9568 2.3684 30.1559 20.5875 6.4758 9.8046 22.8982 16.3040 6.4112 87.7715 54.6093
temp: 298.150 k
press: 1.00000 atm
elementType: 8 8 8 8 7 7 6 6 6 6 6 6 6 6 6 6 6 6 1 1 1 1 1 1 1 1 1 1 1 1 1 1
symmnumber: 1
zpe: 655979.6 jmol-1
zpe.correction: 0.249849 hartree
zpe.thermalcorrener: 0.266103 hartree
zpe.thermalcorrenthalpy: 0.267048 hartree
zpe.thermalcorrgfe: 0.203452 hartree
zpe.sumelectzpe: -874.777537 hartree
zpe.sumelectthermal: -874.761283 hartree
zpe.sumelectthermalent: -874.760339 hartree
zpe.sumelectthermalfe: -874.823935 hartree
dipole: -4.3226 5.4172 1.7763
dipole: 7.1544
quadrupole: -75.2140 -115.0598 -105.7547
quadrupole: -4.4885 -3.9469 3.9737
quadrupole: 23.4622 -16.3837 -7.0785 -4.4885 -3.9469 3.9737
hfenergy: -875.0273866 hartree
pointgroup: C01 [X(C12H14N2O4)]
dipole: -1.5471612 -2.0123417 -1.2164472 debye
polarizability: 200.2997289|-11.5544804|167.15211|23.7075175|27.5138752|99.388044 unknown
InChI: InChI=1S/C12H14N2O4/c1-8-3-2-4-9(5-8)14-6-10(18-12(14)16)7-17-11(13)15/h2-5,10H,6-7,13H2,1H3
charge 0 multiplicity 1
32 atoms
O  -1.213116 2.48242 -0.000899
O  -3.803494 -0.178861 -0.142623
O  0.797184 3.173952 0.960963
O  -2.455791 -2.086988 0.231862
N  0.535753 0.999808 -0.019593
N  -4.613841 -2.229672 -0.681946
C  -1.771759 1.208921 -0.535042
C  -0.532388 0.302741 -0.770462
C  -2.789499 0.690484 0.500655
C  1.832884 0.421601 0.153773
C  0.149286 2.284492 0.379881
C  2.089808 -0.865663 -0.386883
C  2.864291 1.105678 0.855504
C  3.355133 -1.485327 -0.238192
C  4.120524 0.486197 0.999828
C  4.373708 -0.797046 0.463023
C  3.600184 -2.864273 -0.829059
C  -3.529571 -1.565213 -0.162992
H  -2.301495 1.451442 -1.471006
H  -0.713003 -0.711278 -0.376396
H  -0.267553 0.236194 -1.84278
H  -3.364944 1.543016 0.892694
H  -2.293679 0.147001 1.324415
H  1.306338 -1.407853 -0.926621
H  2.677869 2.098289 1.268983
H  4.912333 1.015434 1.541835
H  5.357723 -1.262865 0.588537
H  4.602302 -3.24183 -0.563471
H  2.855485 -3.596629 -0.46543
H  3.529657 -2.847577 -1.933354
H  -5.452988 -1.719719 -0.947986
H  -4.570042 -3.240978 -0.77122
