program: Gaussian 09
title: 000207116
version: EM64L-G09RevD.01
frameworkgroup: C1[X(C12H17NO2)]
method: RPBEPBE
basis: SDD
operation: Freq
keyword: #p
keyword: freq=noraman
keyword: PBEPBE/SDD
title: #p freq=noraman PBEPBE/SDD
converged: YES YES NO NO
title: Mulliken charges:
elementType: O O N C C C C C C C C C C C C H H H H H H H H H H H H H H H H H
charge: -0.247393 -0.281828 -0.114151 -0.347537 -0.341912 -0.451527 -0.322375 -0.319361 0.299999 0.153084 -0.361763 -0.362635 -0.256110 -0.239267 -0.536083 0.197075 0.230315 0.210558 0.189214 0.227783 0.222697 0.190422 0.213905 0.212144 0.191058 0.273524 0.237285 0.225150 0.223152 0.242826 0.221080 0.220669
chargesum: 0.00000
title: Mulliken charges with hydrogens summed into heavy atoms:
elementType: O O N C C C C C C C C C C C C
charge: -0.247393 -0.281828 -0.114151 0.079853 0.057860 -0.001047 0.081952 0.083842 0.299999 0.153084 -0.088239 -0.125350 -0.030960 -0.016115 0.148492
polarizability: 1.70759333e+02 -1.31098101e+00 1.50693303e+02 -1.11116871e+01 -4.53384611e-01 9.80943151e+01
1716.lowfreq: -12.9336 -0.0005 0.0007 0.0007 0.8956 4.8998 26.5440 51.9713 66.0060
frequency: 26.2908 51.9563 65.9886 100.3307 153.6045 156.7012 191.6650 229.2993 246.1295 285.6951 286.4825 296.9063 313.1104 397.9624 429.8684 447.2687 466.7390 487.0555 536.7100 557.2670 592.1750 609.0880 713.1980 747.0371 761.1855 773.0277 802.7257 816.5918 841.3436 851.8121 894.6104 943.0242 976.3077 988.8422 997.8634 1001.1390 1028.7336 1038.6805 1053.0110 1081.8245 1089.8661 1106.8197 1112.1010 1131.2784 1145.8768 1148.8001 1167.6868 1187.0027 1191.2252 1219.4076 1225.2300 1257.5850 1271.1642 1284.9839 1291.8321 1325.3298 1337.4681 1353.3244 1370.3071 1374.4900 1398.5174 1429.1880 1443.0550 1443.7286 1447.7054 1450.2613 1458.9317 1466.0260 1467.6339 1472.1894 1486.2017 1595.5125 1607.4001 2860.2852 2869.0601 2900.8982 2950.4055 2954.6638 2958.9992 2991.6974 3022.6876 3038.0008 3046.7423 3078.4275 3082.0979 3121.9057 3126.1299 3137.9158 3153.3153 3166.2397
redmass: 3.5190 3.3765 4.5711 3.2781 3.9485 3.2560 3.6412 1.5184 1.6745 2.9963 2.6868 2.9008 2.2586 1.8966 5.3582 3.1435 2.9385 4.9222 3.6410 4.2381 4.6609 2.1662 2.5555 4.8793 1.4782 3.9401 4.1075 3.9830 1.6306 1.3496 2.2941 1.3885 1.5418 7.5289 1.9405 2.0502 2.1382 2.0214 1.9918 3.5753 2.5044 2.1789 1.2633 2.2279 2.6458 1.4659 1.1266 1.1006 1.6881 1.1804 3.0939 1.4367 1.3947 1.4343 1.2735 1.3776 1.2810 1.4819 1.2724 1.9128 3.0061 1.4615 1.5158 1.0860 1.1160 1.0972 1.1308 1.0867 1.1818 1.1333 1.7879 7.0722 6.5579 1.0705 1.0696 1.0679 1.0668 1.0668 1.0328 1.0894 1.0895 1.0895 1.1039 1.0960 1.0974 1.0993 1.0851 1.0900 1.0939 1.0992
irintensity: 0.2173 0.0081 0.1477 6.3696 6.2224 4.1077 1.8375 1.3944 1.2891 3.7081 2.9166 0.2314 10.7051 0.4484 0.0830 5.1753 3.0071 9.7335 1.1751 7.0524 0.0531 2.8329 7.1148 11.8472 87.5157 4.1501 18.8375 8.3048 0.3997 1.0275 11.8156 4.0366 2.2691 37.7950 21.6377 16.7438 10.4422 17.9298 24.1734 41.2642 55.6329 4.7154 0.1596 35.1680 2.8478 0.9188 12.8761 2.2303 9.5001 11.1312 133.3050 11.9439 12.7904 25.6887 2.0792 15.6507 13.2201 1.8337 2.1945 1.4085 6.3819 17.9773 12.6658 2.4340 0.9234 13.5335 13.1997 28.9808 65.9025 18.0325 14.6488 14.3997 23.2740 52.0802 100.2041 59.0227 30.3041 106.7626 68.3115 17.1715 48.9706 27.0008 48.1745 44.1365 37.4835 23.9683 0.6851 5.9220 25.9339 23.6521
temp: 298.150 k
press: 1.00000 atm
elementType: 8 8 7 6 6 6 6 6 6 6 6 6 6 6 6 1 1 1 1 1 1 1 1 1 1 1 1 1 1 1 1 1
symmnumber: 1
zpe: 708529.3 jmol-1
zpe.correction: 0.269865 hartree
zpe.thermalcorrener: 0.283977 hartree
zpe.thermalcorrenthalpy: 0.284921 hartree
zpe.thermalcorrgfe: 0.228124 hartree
zpe.sumelectzpe: -671.479377 hartree
zpe.sumelectthermal: -671.465265 hartree
zpe.sumelectthermalent: -671.464321 hartree
zpe.sumelectthermalfe: -671.521118 hartree
dipole: -3.0953 -0.8679 -0.1218
dipole: 3.2170
quadrupole: -88.1798 -83.8755 -89.6694
quadrupole: 4.6380 -8.0217 1.1129
quadrupole: -0.9382 3.3660 -2.4278 4.6380 -8.0217 1.1129
hfenergy: -671.7492418 hartree
pointgroup: C01 [X(C12H17N1O2)]
dipole: -1.1917375 -0.4191132 -0.0773962 debye
polarizability: 170.5289306|1.3723459|150.2619705|-11.9642056|4.411308|98.7560506 unknown
InChI: InChI=1S/C12H17NO2/c1-14-12-5-3-2-4-11(12)10-13-6-8-15-9-7-13/h2-5H,6-10H2,1H3
charge 0 multiplicity 1
32 atoms
O  4.325603 0.163945 0.598123
O  -2.196305 -1.921233 -0.038969
N  1.589896 -0.111857 -0.344561
C  1.898377 0.004638 1.105306
C  2.719581 -0.757913 -1.058877
C  0.297238 -0.794741 -0.592398
C  3.198154 0.799275 1.302914
C  4.008675 0.049723 -0.835439
C  -0.91042 0.084146 -0.283445
C  -2.175963 -0.511261 -0.010041
C  -0.826167 1.493279 -0.29447
C  -3.315146 0.285301 0.258085
C  -1.956885 2.302709 -0.033794
C  -3.199293 1.694685 0.244291
C  -3.462352 -2.589164 0.266808
H  2.008553 -1.005931 1.574286
H  1.063596 0.524165 1.610456
H  2.490175 -0.791351 -2.14128
H  2.884704 -1.808293 -0.707808
H  0.209854 -1.749786 -0.022465
H  0.266683 -1.078099 -1.664162
H  3.060298 1.836715 0.927526
H  3.492848 0.825621 2.365009
H  4.878286 -0.452913 -1.290531
H  3.890184 1.064546 -1.273849
H  0.151866 1.93621 -0.512763
H  -4.284999 -0.174339 0.471034
H  -1.866675 3.394124 -0.048947
H  -4.083092 2.309302 0.449607
H  -3.242794 -3.665238 0.20267
H  -4.245573 -2.324247 -0.470033
H  -3.814709 -2.340018 1.286813
