program: Gaussian 09
title: 000207109
version: EM64L-G09RevD.01
frameworkgroup: C1[X(C8H16N2S2)]
method: RPBEPBE
basis: SDD
operation: Freq
keyword: #p
keyword: freq=noraman
keyword: PBEPBE/SDD
title: #p freq=noraman PBEPBE/SDD
converged: YES YES NO NO
title: Mulliken charges:
elementType: S S N N C C C C C C C C H H H H H H H H H H H H H H H H
charge: 0.148951 -0.014375 -0.065159 -0.004697 -0.359101 -0.353674 -0.371588 -0.378051 -0.612952 -0.454496 -0.563953 -0.660762 0.201562 0.220764 0.218922 0.197687 0.228733 0.253443 0.241302 0.234591 0.226441 0.192674 0.224560 0.283786 0.282605 0.227706 0.228633 0.226447
chargesum: 0.00000
title: Mulliken charges with hydrogens summed into heavy atoms:
elementType: S S N N C C C C C C C C
charge: 0.148951 -0.014375 -0.065159 -0.004697 0.063225 0.062935 0.110589 0.097842 0.030724 -0.454496 0.002437 0.022024
polarizability: 1.89378692e+02 -1.28726083e+00 1.40171195e+02 8.81298748e+00 -5.76925020e+00 8.92012198e+01
1716.lowfreq: -11.0065 0.0017 0.0020 0.0023 3.5760 11.6171 20.8796 40.7284 54.3996
frequency: 20.5630 40.1796 54.3738 68.4370 113.3313 162.0503 175.8593 230.0205 236.1827 250.5247 282.6781 298.4515 314.6221 331.1790 398.5438 411.0507 421.7118 470.5399 517.4091 520.9830 618.9053 636.3779 743.4019 774.9728 811.6590 833.5452 903.3092 967.7921 994.1668 1000.7862 1032.1073 1045.3393 1045.6392 1063.2488 1069.0745 1077.9959 1126.7782 1145.8788 1148.8390 1194.5488 1225.2779 1225.5962 1239.3153 1271.4741 1286.6166 1292.0126 1334.5486 1347.7218 1354.9062 1371.0521 1395.3867 1428.0595 1433.1472 1444.7683 1451.7803 1456.8841 1462.8866 1471.4297 1472.9175 1476.6019 1482.2327 1482.3352 2854.6955 2859.9562 2874.4497 2987.0264 2991.8292 2996.1684 3023.6391 3031.7885 3037.6896 3044.9297 3081.0428 3081.4985 3084.7222 3086.7461 3100.0709 3125.8500
redmass: 2.9773 2.8761 5.1494 3.1864 3.2864 3.0060 2.8460 1.2295 1.0941 3.3421 7.5137 2.6083 2.3838 2.4438 3.2914 3.2093 3.7121 2.7681 4.9160 7.3776 2.3339 4.4862 3.6750 1.1113 3.7713 1.6786 2.9555 3.1008 1.8575 2.5325 2.4580 1.3859 1.4657 2.0937 1.8159 1.7698 1.5946 2.7112 3.4559 1.0879 2.0867 1.2304 1.8326 1.2735 1.5131 1.4214 1.2523 1.3600 1.3579 1.3990 1.2061 2.1497 1.1689 1.0812 1.0764 1.0772 1.0576 1.0401 1.3279 1.1098 1.0528 1.0495 1.0691 1.0649 1.0620 1.0354 1.0642 1.0664 1.0739 1.0885 1.0901 1.0590 1.1010 1.0976 1.1014 1.0988 1.0964 1.1080
irintensity: 0.0836 0.2272 0.7248 4.3275 0.4499 4.0524 4.6377 0.8150 0.1129 0.7261 1.9555 0.9344 15.0345 0.3688 3.0196 5.6205 12.6015 0.4951 9.9556 4.8260 1.3972 3.8216 7.0270 8.9065 22.9081 0.2089 38.4315 103.3465 16.7819 53.0044 21.5372 2.1615 1.9532 1.6936 1.7291 2.4041 16.2886 46.5056 35.2472 3.8238 79.5184 1.0761 92.5801 16.7024 45.9778 41.2650 3.4836 0.9750 2.1110 1.7387 20.5475 187.3012 4.6705 15.6890 14.9639 0.2690 21.1156 15.7724 66.7074 7.2975 8.4938 6.1459 46.9460 41.5965 190.1508 36.3129 23.1799 44.3067 45.9831 50.2542 51.0907 2.1787 29.1437 23.4110 16.3381 10.8033 11.5351 20.8816
temp: 298.150 k
press: 1.00000 atm
elementType: 16 16 7 7 6 6 6 6 6 6 6 6 1 1 1 1 1 1 1 1 1 1 1 1 1 1 1 1
symmnumber: 1
zpe: 617405.3 jmol-1
zpe.correction: 0.235157 hartree
zpe.thermalcorrener: 0.249254 hartree
zpe.thermalcorrenthalpy: 0.250199 hartree
zpe.thermalcorrgfe: 0.192419 hartree
zpe.sumelectzpe: -1219.092588 hartree
zpe.sumelectthermal: -1219.078491 hartree
zpe.sumelectthermalent: -1219.077547 hartree
zpe.sumelectthermalfe: -1219.135327 hartree
dipole: 2.0886 -2.5300 -0.3044
dipole: 3.2948
quadrupole: -76.0981 -91.9489 -90.0254
quadrupole: 3.9092 -1.2453 0.7881
quadrupole: 9.9260 -5.9248 -4.0013 3.9092 -1.2453 0.7881
hfenergy: -1219.3277455 hartree
pointgroup: C01 [X(C8H16N2S2)]
dipole: -0.9007248 0.7008867 0.6146291 debye
polarizability: 184.7278318|17.2208017|115.7456151|-15.3108428|23.678584|118.2776599 unknown
InChI: InChI=1S/C8H16N2S2/c1-3-12-8(11)10-6-4-9(2)5-7-10/h3-7H2,1-2H3
charge 0 multiplicity 1
28 atoms
S  2.030807 1.137816 0.331259
S  1.659896 -0.99113 -1.922704
N  -3.072195 0.061809 0.185577
N  -0.218718 -0.338555 -0.037279
C  -2.492786 -0.649602 -0.97992
C  -2.122068 1.069006 0.70919
C  -1.168977 -1.334481 -0.59388
C  -0.795642 0.395515 1.117121
C  -4.401972 0.633458 -0.102935
C  1.033712 -0.147917 -0.569349
C  3.650382 1.111769 -0.649461
C  4.608522 2.135604 -0.023676
H  -2.306352 0.042377 -1.840399
H  -3.208068 -1.422901 -1.316357
H  -2.566546 1.55009 1.60046
H  -1.904822 1.871496 -0.041848
H  -1.361273 -2.101627 0.181479
H  -0.696804 -1.809439 -1.468344
H  -0.087445 1.152688 1.485777
H  -0.99019 -0.330627 1.930291
H  -5.088557 -0.16991 -0.424281
H  -4.384588 1.415129 -0.903578
H  -4.817049 1.090491 0.813142
H  4.037537 0.08188 -0.607363
H  3.399378 1.344948 -1.695854
H  4.195791 3.15932 -0.062384
H  4.83687 1.892093 1.029109
H  5.559852 2.131898 -0.586891
