program: Gaussian 09
title: 000207096
version: EM64L-G09RevD.01
frameworkgroup: C1[X(C7H14N2OS2)]
method: RPBEPBE
basis: SDD
operation: Freq
keyword: #p
keyword: freq=noraman
keyword: PBEPBE/SDD
title: #p freq=noraman PBEPBE/SDD
converged: NO YES NO NO
title: Mulliken charges:
elementType: S S O N N C C C C C C C H H H H H H H H H H H H H H
charge: -0.011452 0.015393 -0.434786 -0.090850 0.032940 -0.335062 -0.356074 -0.387322 -0.373298 -0.337061 -0.329898 -0.526435 0.204605 0.215805 0.221097 0.205181 0.237683 0.241184 0.254736 0.231034 0.210179 0.194241 0.204848 0.215605 0.334775 0.162933
chargesum: 0.00000
title: Mulliken charges with hydrogens summed into heavy atoms:
elementType: S S O N N C C C C C C C
charge: 0.151480 0.015393 -0.100012 -0.090850 0.032940 0.085349 0.070203 0.091545 0.112473 0.067358 0.090555 -0.526435
polarizability: 1.70927876e+02 4.03347420e+00 1.32276161e+02 1.12503951e+01 1.21630116e+00 8.05900658e+01
1716.lowfreq: -10.5199 -1.5580 -0.0012 -0.0009 0.0011 11.7930 26.8454 48.6580 59.8310
frequency: 26.6247 48.5937 59.8252 72.7820 93.5097 169.0690 222.7848 244.2851 263.7962 307.6735 310.9430 324.4869 326.0947 348.0285 404.1430 409.8474 433.4345 466.1232 526.3461 550.7107 622.7150 761.9395 788.1587 806.5378 829.9354 862.1600 923.9541 961.5592 987.8428 997.1820 1039.8028 1042.4563 1053.0680 1061.6195 1093.5350 1118.8736 1140.6549 1154.8173 1194.8151 1222.7365 1242.9854 1269.0560 1283.6731 1293.4178 1302.1137 1334.8714 1338.6255 1356.9082 1360.3223 1378.3806 1396.4262 1440.2060 1451.4761 1455.8311 1465.0262 1472.0213 1479.5652 1482.2945 2473.0774 2867.9300 2877.7591 2897.9462 2983.4102 2994.6128 2999.0645 3008.3737 3040.5722 3051.4075 3083.5072 3088.4009 3098.5308 3562.2913
redmass: 6.5519 2.4481 5.5931 3.5082 3.8257 3.3496 3.1820 5.4647 2.8416 1.5574 1.4864 2.5607 1.5814 2.8593 3.8701 2.3660 4.9516 2.7587 6.8064 5.5991 2.1199 3.6526 1.8769 1.2600 1.5732 2.0674 2.2183 4.0538 3.1937 2.7927 2.0069 2.0636 1.8669 2.3859 2.1739 2.1950 2.6342 2.4486 1.0698 2.3851 1.3960 1.2947 1.2534 1.4031 1.2499 1.2489 1.2994 1.3547 1.3300 1.2856 1.3713 1.7589 1.0801 1.0797 1.0841 1.0941 1.6341 1.0914 1.0375 1.0712 1.0694 1.0677 1.0663 1.0640 1.0656 1.0908 1.0898 1.0899 1.0995 1.0994 1.0972 1.0663
irintensity: 1.9092 4.2199 0.8651 4.9557 0.8172 1.4979 2.1225 6.6133 3.4329 87.2906 16.2455 51.1863 27.7295 54.2016 13.3500 3.1244 6.1223 0.6210 4.2368 7.9909 3.6003 15.5088 19.6904 5.4962 4.1814 49.9465 22.1706 141.6828 45.0333 91.2663 5.9674 14.2571 4.7659 9.0006 9.5254 46.7914 40.8989 41.8206 3.6282 8.0866 101.1247 31.6004 28.2276 37.1335 19.5333 4.2317 8.0528 3.8664 13.0329 3.7367 0.7780 181.3000 14.4827 0.0901 2.0079 4.1142 101.9322 12.3316 3.0124 47.3594 51.6996 102.7558 57.8633 21.2448 45.7954 20.4815 42.4252 36.7367 41.0986 10.4838 11.7195 8.0625
temp: 298.150 k
press: 1.00000 atm
elementType: 16 16 8 7 7 6 6 6 6 6 6 6 1 1 1 1 1 1 1 1 1 1 1 1 1 1
symmnumber: 1
zpe: 550901.6 jmol-1
zpe.correction: 0.209827 hartree
zpe.thermalcorrener: 0.223414 hartree
zpe.thermalcorrenthalpy: 0.224358 hartree
zpe.thermalcorrgfe: 0.167855 hartree
zpe.sumelectzpe: -1254.991225 hartree
zpe.sumelectthermal: -1254.977638 hartree
zpe.sumelectthermalent: -1254.976694 hartree
zpe.sumelectthermalfe: -1255.033197 hartree
dipole: 2.8655 -0.3146 0.8444
dipole: 3.0038
quadrupole: -104.2133 -86.1686 -89.7899
quadrupole: -16.7199 2.7380 0.2609
quadrupole: -10.8227 7.2220 3.6007 -16.7199 2.7380 0.2609
hfenergy: -1255.2010523 hartree
pointgroup: C01 [X(C7H14N2O1S2)]
dipole: -1.1219366 0.010263 0.3711967 debye
dipolederiv: -0.0966448 0.2400907 0.028365 0.4077806 -0.6632538 -0.2342597 0.0844162 -0.2131357 -0.2083372 -0.6192331 -0.2422887 0.0403862 -0.331868 -0.7892112 -0.0581345 0.0730356 -0.0491004 -0.2244608 -1.0167098 -0.0781322 -0.0194805 -0.0549696 -0.1945103 0.1915407 -0.0476048 0.164292 -0.490452 -0.8567967 -0.0371849 -0.0120598 -0.0117085 -0.467452 0.0159564 -0.0290632 -0.0065953 -0.5290408 -1.4736342 -0.1655096 0.257255 -0.0129468 -0.5514937 -0.0668296 0.2633822 -0.0249113 -0.3047905 0.2029327 -0.1340176 -0.1463646 -0.266429 0.2728193 0.0674508 -0.0967302 0.048928 0.3662174 0.276774 0.196105 -0.0705697 0.3084463 0.3716661 -0.0528971 0.035638 -0.0488345 0.2902057 0.2678497 0.1664174 0.0019368 0.3432792 0.2961469 -0.0738694 0.0356403 -0.0666824 0.2540148 0.1038933 -0.1328291 -0.0341772 -0.4615011 0.1992345 0.0937294 -0.0989823 0.0511549 0.3058432 0.516211 -0.0380138 0.0887955 -0.114902 0.0851266 0.0297159 0.1165484 0.035733 0.3360452 0.7136234 -0.0242408 0.0769555 -0.0454222 0.2499538 -0.0641407 0.0226807 -0.0296813 0.353063 1.6145471 0.24871 -0.4514643 0.1556885 1.297429 0.3002878 -0.5901188 0.255475 0.0416148 -0.0144106 0.0635621 0.0495638 0.0525698 0.0111215 0.0817348 0.0738165 -0.0502089 -0.2196017 -0.0290985 -0.1297204 0.0093159 -0.0988088 -0.0852634 -0.0055083 0.0120606 0.006236 0.0700053 -0.0480561 0.1095595 0.0629802 0.0638428 -0.0716177 -0.061953 0.0468976 -0.0704965 0.0466468 -0.0142509 -0.0819946 0.0195646 -0.0794766 -0.0209234 0.0106512 0.0512501 0.1442887 -0.1892708 -0.0080783 -0.0750237 0.0403371 -0.1003655 0.044898 0.0022752 0.0434702 0.0918185 -0.1216364 -0.0025629 0.0939505 0.0328117 0.0546369 -0.0005359 -0.0428894 0.0424226 -0.0724953 0.0760459 0.112167 -0.1248293 -0.0458924 0.0095128 0.0031626 -0.016474 -0.0173396 0.0319655 0.1091158 0.0134234 0.0458059 0.0680515 0.0901179 0.0541211 0.0753749 0.0704996 0.0075891 -0.1338951 -0.0476002 -0.0021914 0.0343328 -0.0302673 0.0545452 -0.0209089 -0.1102755 0.0205063 -0.2293545 -0.010103 0.0465567 -0.0021569 0.1044303 -0.137594 -0.0296963 0.031484 -0.0618595 0.0562302 -0.0131615 0.0030892 -0.0269159 -0.0048676 0.0606852 -0.0343646 -0.0026025 0.0157521 -0.2103311 0.0417961 0.0716993 -0.0109168 0.0818325 -0.1124656 -0.0117071 0.0092318 -0.0471596 0.0676814 0.3640169 0.0335283 -0.0376001 0.0953321 0.0283158 -0.1136357 -0.0455362 -0.1226561 0.2992383 0.023106 -0.0530984 0.0469467 -0.1539368 0.0650953 0.0185512 0.0257786 -0.0099222 0.1892032 unknown
polarizability: 170.0465669|7.9139662|130.8402323|-11.9955592|9.3554462|82.9073035 unknown
InChI: InChI=1S/C7H14N2OS2/c10-6-5-8-1-3-9(4-2-8)7(11)12/h10-11H,1-6H2
charge 0 multiplicity 1
26 atoms
S  3.574638 -1.568911 -0.699842
S  3.852897 1.460247 -0.094069
O  -4.979391 -0.489617 -0.420517
N  -1.279508 0.143543 0.208285
N  1.600695 -0.038496 0.382694
C  -0.553914 -1.013284 -0.371129
C  -0.433105 1.362279 0.151707
C  0.760468 -1.261748 0.396285
C  0.880477 1.142905 0.924194
C  -2.629214 0.337296 -0.375491
C  -3.660564 -0.65239 0.208666
C  2.889574 0.048834 -0.070775
H  -0.318464 -0.853333 -1.453552
H  -1.180778 -1.919075 -0.29325
H  -0.980505 2.199574 0.621679
H  -0.189058 1.656257 -0.899401
H  0.527868 -1.514184 1.448966
H  1.301745 -2.107295 -0.054832
H  1.544528 2.017748 0.839876
H  0.656733 0.95294 1.991917
H  -2.633958 0.246232 -1.488674
H  -2.956584 1.368851 -0.135746
H  -3.707862 -0.530548 1.310091
H  -3.385288 -1.696122 -0.014843
H  -5.344572 0.40031 -0.184403
H  4.791342 -0.998613 -1.013938
