program: Gaussian 09
title: 000207155
version: EM64L-G09RevD.01
frameworkgroup: C1[X(C18H17NO3)]
method: RPBEPBE
basis: SDD
operation: Freq
keyword: #p
keyword: freq=noraman
keyword: PBEPBE/SDD
title: #p freq=noraman PBEPBE/SDD
converged: YES YES NO NO
title: Mulliken charges:
elementType: O O O N C C C C C C C C C C C C C C C C C C H H H H H H H H H H H H H H H H H
charge: -0.244737 -0.285071 -0.239149 -0.118954 -0.460672 -0.348544 -0.344988 0.337350 -0.322117 -0.319266 -0.018985 0.210215 -0.373866 0.042222 -0.390338 0.174493 0.201523 -0.247747 -0.349245 -0.364766 -0.250682 -0.209829 0.226539 0.230604 0.202224 0.227926 0.212604 0.192426 0.190839 0.217832 0.215548 0.192340 0.281520 0.282071 0.234654 0.280739 0.261520 0.237209 0.236558
chargesum: 0.00000
title: Mulliken charges with hydrogens summed into heavy atoms:
elementType: O O O N C C C C C C C C C C C C C C C C C C
charge: -0.244737 -0.285071 -0.239149 -0.118954 -0.003529 0.081607 0.060041 0.337350 0.086554 0.088623 -0.018985 0.210215 -0.092346 0.042222 -0.108267 0.174493 0.201523 -0.013094 -0.068506 -0.103245 -0.013473 0.026729
polarizability: 2.92620750e+02 2.06824614e+01 2.36078318e+02 -1.72553687e+01 5.12497058e+00 1.15827896e+02
1716.lowfreq: -6.7989 -0.0006 0.0007 0.0009 4.8710 8.4595 23.6794 45.6241 50.1150
frequency: 23.4607 45.6195 50.0672 73.7198 90.9883 122.6692 142.7979 191.3291 205.2771 239.1990 252.0678 257.0796 294.9291 298.6638 316.4066 323.5796 375.4229 399.3858 422.1323 426.4951 469.2734 478.5616 495.2452 509.1804 519.7012 544.9161 578.9610 599.8527 623.6368 655.4180 671.3201 679.8248 729.1594 768.8761 771.6265 790.6749 795.2140 807.6246 833.2110 841.7938 845.0596 879.2608 884.2030 894.4827 954.5814 965.4490 973.8509 990.6500 1001.0103 1009.4604 1010.5366 1026.7888 1028.4720 1053.8310 1060.3656 1084.5102 1095.4095 1106.1918 1134.8530 1145.9112 1162.0250 1167.6293 1171.4184 1191.0595 1196.5763 1209.2087 1222.1914 1246.8637 1256.5544 1269.9258 1284.0316 1294.4014 1312.1439 1330.3130 1340.7132 1356.4895 1372.2551 1378.4434 1398.7771 1403.1942 1422.4330 1445.3823 1448.1430 1449.2897 1452.6741 1456.8629 1461.6470 1465.7046 1472.4436 1556.4791 1576.6186 1602.1590 1606.6458 1625.9076 2868.6959 2876.1021 2898.5665 2953.2384 2957.0927 2994.4358 3025.4518 3037.6215 3082.4035 3085.6885 3137.7033 3139.8910 3152.0507 3152.3967 3165.3885 3168.1067 3176.0769
redmass: 4.7049 4.1844 4.4632 5.5891 4.4373 4.7585 6.0119 3.7123 4.2515 2.9078 4.0037 3.0980 5.6358 4.0500 2.2823 4.5751 6.0632 1.9656 4.1878 5.1139 2.8725 5.4339 4.4715 9.3322 3.6109 3.9165 7.0220 2.1312 5.9244 5.2570 6.0314 4.4766 4.4607 1.5817 3.7614 1.5749 5.7167 3.9541 1.9846 1.9694 3.7361 6.1604 1.5246 2.3299 1.6360 3.2402 1.3733 1.7023 1.3348 1.9874 1.7470 2.0234 2.1511 1.9888 1.9573 3.7336 2.2355 2.1929 2.5310 2.7329 1.2235 2.5099 1.2045 1.0672 2.2250 3.0517 1.1628 2.4469 1.6311 1.3270 1.3945 1.2839 2.0366 1.5157 1.3033 1.4654 1.2672 1.7209 8.9841 5.6440 2.6483 1.0824 1.1538 2.5465 1.0976 1.4092 2.1854 1.6387 1.2929 9.3102 7.1143 7.0870 7.9194 7.4770 1.0701 1.0696 1.0683 1.0669 1.0668 1.0889 1.0899 1.0900 1.0959 1.0975 1.0869 1.0861 1.0900 1.0915 1.0953 1.0988 1.1002
irintensity: 0.5831 1.4700 0.3348 3.6289 0.1696 1.2901 0.0351 5.0025 2.8341 3.9384 0.9297 0.2161 0.2163 4.8307 15.1403 4.6255 3.5820 0.8220 0.8395 1.2721 1.9145 7.4255 10.2353 3.0363 2.5137 0.6483 0.6613 0.7708 14.7020 1.5584 1.9211 6.9406 4.9625 127.2807 2.4580 1.0640 5.5079 15.9103 31.0420 1.1502 2.8453 35.8898 0.3966 15.3709 1.0660 9.0999 2.4773 6.6854 0.3072 19.6525 11.1000 2.8299 9.9459 21.7337 29.7434 50.6302 23.9550 0.4866 90.5643 4.3239 5.9364 7.8422 3.4295 1.5495 49.6896 56.5375 4.4590 28.0131 8.6815 8.7479 21.4452 4.6915 129.1818 53.9392 26.0385 4.9063 2.7996 13.1622 13.2983 6.3020 121.6838 2.8009 9.5343 58.6520 10.0066 40.7897 9.0242 42.0644 3.4372 162.5322 55.5052 81.6866 83.2485 16.9269 51.9112 79.4389 60.1844 29.3072 100.8627 13.7428 46.7446 29.2207 40.1853 35.0854 2.3885 3.5520 4.6539 2.4803 12.5929 16.4819 18.6962
temp: 298.150 k
press: 1.00000 atm
elementType: 8 8 8 7 6 6 6 6 6 6 6 6 6 6 6 6 6 6 6 6 6 6 1 1 1 1 1 1 1 1 1 1 1 1 1 1 1 1 1
symmnumber: 1
zpe: 815480.9 jmol-1
zpe.correction: 0.310600 hartree
zpe.thermalcorrener: 0.328260 hartree
zpe.thermalcorrenthalpy: 0.329204 hartree
zpe.thermalcorrgfe: 0.264173 hartree
zpe.sumelectzpe: -974.955292 hartree
zpe.sumelectthermal: -974.937633 hartree
zpe.sumelectthermalent: -974.936689 hartree
zpe.sumelectthermalfe: -975.001719 hartree
dipole: 0.7978 -2.7371 -1.0021
dipole: 3.0220
quadrupole: -138.4790 -122.1934 -128.4675
quadrupole: 20.2738 -6.5777 2.3337
quadrupole: -8.7657 7.5199 1.2458 20.2738 -6.5777 2.3337
hfenergy: -975.2658924 hartree
pointgroup: C01 [X(C18H17N1O3)]
dipole: -0.3155782 -1.0394904 0.4831594 debye
polarizability: 293.5452394|-21.3265289|233.8199528|-11.4795591|-16.4144884|117.1617723 unknown
InChI: InChI=1S/C18H17NO3/c20-17-14-5-1-2-7-16(14)22-18-13(4-3-6-15(17)18)12-19-8-10-21-11-9-19/h1-7H,8-12H2
charge 0 multiplicity 1
39 atoms
O  -5.825544 -0.974857 -0.802123
O  0.997527 -0.869284 0.348472
O  3.64599 2.311367 -0.391959
N  -3.203264 -0.361256 0.286331
C  -1.790133 -0.597465 0.657029
C  -3.428918 -0.445324 -1.181706
C  -4.144305 -1.257891 1.005468
C  -0.894382 0.602992 0.361796
C  -4.886829 -0.086525 -1.508559
C  -5.592791 -0.884305 0.648852
C  0.509348 0.448397 0.222108
C  1.377438 1.547354 -0.024096
C  -1.414423 1.909313 0.257839
C  2.842545 1.348631 -0.169536
C  0.811606 2.846316 -0.12534
C  3.303107 -0.057125 -0.036696
C  2.37667 -1.104786 0.213785
C  -0.572822 3.026884 0.01593
C  4.67967 -0.390366 -0.1550
C  2.791503 -2.447993 0.34506
C  5.109332 -1.720801 -0.02746
C  4.160049 -2.75038 0.223346
H  -1.368262 -1.503818 0.161617
H  -1.755055 -0.802421 1.746175
H  -3.207455 -1.473684 -1.562785
H  -2.749061 0.260496 -1.69359
H  -3.993118 -1.140079 2.095566
H  -3.972115 -2.332549 0.745407
H  -5.083212 0.96952 -1.221909
H  -5.100511 -0.225027 -2.581051
H  -6.308971 -1.586191 1.107079
H  -5.805098 0.149288 0.998592
H  -2.497476 2.026217 0.372128
H  1.494271 3.681241 -0.313473
H  -1.008292 4.028583 -0.058678
H  5.379691 0.429435 -0.34738
H  2.043553 -3.222417 0.538073
H  6.171445 -1.968834 -0.119858
H  4.493592 -3.788852 0.323147
