program: Gaussian 09
title: 000207085
version: EM64L-G09RevD.01
frameworkgroup: C1[X(C22H23NO2)]
method: RPBEPBE
basis: SDD
operation: Freq
keyword: #p
keyword: freq=noraman
keyword: PBEPBE/SDD
title: #p freq=noraman PBEPBE/SDD
converged: YES YES NO NO
title: Mulliken charges:
elementType: O O N C C C C C C C C C C C C C C C C C C C C C C H H H H H H H H H H H H H H H H H H H H H H H
charge: -0.294245 -0.229253 0.001633 -0.175087 -0.013256 -0.464798 -0.443384 -0.531645 -0.440828 -0.446627 -0.599606 0.257990 0.358092 0.342807 0.336564 0.347008 -0.755472 -0.427651 -0.420521 -0.426436 -0.425856 -0.243541 -0.244924 -0.237795 -0.239124 0.263692 0.260782 0.211894 0.219971 0.229710 0.207946 0.248670 0.238820 0.226363 0.229963 0.224105 0.232576 0.255385 0.276580 0.222105 0.241779 0.242110 0.236915 0.237915 0.226929 0.227748 0.226600 0.227396
chargesum: 0.00000
title: Mulliken charges with hydrogens summed into heavy atoms:
elementType: O O N C C C C C C C C C C C C C C C C C C C C C C
charge: -0.294245 -0.229253 0.001633 0.088605 0.247526 -0.032932 -0.005729 -0.044156 0.015498 0.010054 -0.344221 0.257990 0.358092 0.342807 0.336564 0.347008 -0.256788 -0.185872 -0.178411 -0.189521 -0.187941 -0.016612 -0.017175 -0.011195 -0.011727
polarizability: 2.61368666e+02 -1.56972724e+01 2.59098443e+02 2.95609483e+01 8.05734650e+00 1.85685793e+02
1716.lowfreq: -24.3498 -15.7568 -6.8526 -0.0007 -0.0007 -0.0001 1.3668 19.3304 27.7827
frequency: -21.6053 16.9037 27.4249 50.2866 55.1405 72.2350 97.9140 123.2230 129.1279 181.4873 186.7952 222.5621 252.9807 269.8184 284.3665 297.8208 334.7503 350.5257 369.9137 391.2799 400.5824 439.6963 441.2792 461.5915 503.2714 511.1053 527.4691 540.6194 574.1146 598.1574 605.9881 615.1463 644.0286 685.7742 700.5383 720.8860 737.3267 744.1455 757.6292 759.2680 773.9091 786.2628 803.1464 806.6117 809.1413 834.2087 861.5056 871.7372 871.7719 872.5810 886.3609 894.9004 930.9076 939.8635 944.2899 947.6248 957.6986 965.8940 985.4007 985.6077 989.1176 997.5660 1026.3884 1036.5000 1038.2927 1055.2482 1075.5143 1084.0742 1087.9764 1103.4318 1120.8389 1130.9296 1169.3755 1172.5219 1173.9559 1174.1830 1179.9449 1190.5107 1200.0607 1205.5055 1216.2418 1217.8332 1227.7856 1237.1652 1263.9029 1270.3564 1287.7005 1293.1844 1297.4930 1303.3972 1306.2528 1309.7396 1312.6975 1313.8827 1329.1268 1337.3751 1354.5294 1360.0095 1384.4750 1388.8623 1437.0595 1442.9626 1446.7391 1449.5671 1457.8995 1466.0575 1467.8317 1478.2951 1479.5722 1489.2796 1586.8680 1600.6668 1609.1051 1614.2449 1630.8525 2966.1293 2984.1997 2992.8729 3001.3869 3003.9614 3006.9090 3030.7236 3038.9596 3039.4262 3048.1371 3048.5318 3054.2049 3066.2613 3074.0344 3075.5194 3116.2713 3116.6798 3121.3830 3121.7192 3138.7446 3139.0008 3160.2235 3160.6469
redmass: 3.9355 4.5926 3.2691 4.0391 5.0413 4.8316 5.8934 3.3171 3.8686 4.0746 3.1852 4.1762 3.7777 2.5577 5.3371 2.5513 3.1184 4.9193 4.7350 2.4126 2.1035 3.1279 3.2098 4.1619 4.1841 4.5813 4.8937 4.1769 4.8235 6.0410 5.6062 4.8724 5.2647 6.3551 5.0752 3.2010 3.2620 2.6267 1.4621 2.0274 2.1128 2.3379 1.9947 2.3409 2.1459 2.2709 1.5911 1.5324 3.0672 3.4053 3.5441 3.0872 2.3432 1.9901 2.9157 1.4093 3.1729 1.7589 1.3228 1.3255 2.4174 2.8745 2.8727 2.3986 2.2217 2.8584 2.3810 2.4217 3.3687 1.7127 1.8763 1.4081 1.2873 1.0809 1.8023 1.4305 1.1628 1.9762 1.2745 1.4436 1.4885 2.1337 1.2366 1.3084 1.5569 1.4412 1.4716 2.1220 1.4552 1.3436 1.3830 1.3119 1.3510 1.3729 1.3066 1.3969 1.3754 1.4808 9.3384 5.2854 2.0818 1.1891 2.4828 1.0781 1.0788 1.0833 1.0818 2.3036 1.1212 2.5240 6.3458 7.2180 6.4845 7.3468 8.6041 1.0644 1.0593 1.0590 1.0603 1.0607 1.0629 1.0861 1.0949 1.1029 1.1032 1.0850 1.0881 1.1055 1.1051 1.1052 1.0863 1.0861 1.0894 1.0895 1.0933 1.0934 1.1005 1.1005
irintensity: 0.1272 0.7448 0.0243 0.0740 0.5382 1.2937 0.9508 0.9171 0.1792 0.8027 2.2648 6.3842 4.0518 1.1790 4.0040 3.6845 3.2366 0.2803 0.0080 0.5133 2.7209 2.2549 7.6891 5.2337 0.7499 0.1968 1.0849 4.2323 5.0211 3.6821 9.7538 7.6616 13.8032 1.9511 15.5867 20.4870 1.4648 51.6796 20.5202 52.5092 10.8135 12.9546 9.0034 3.4996 3.8082 10.7786 5.8308 0.4618 1.2011 1.2233 0.9916 2.6787 24.6965 4.8258 24.2004 0.0505 50.4813 7.7338 0.0563 0.3872 23.0663 41.1725 14.5732 2.5654 8.5348 11.9614 4.2451 55.5037 392.8246 1.5344 25.4089 0.7464 0.2626 0.0145 6.8458 4.1651 0.5391 0.2702 3.5818 0.2844 1.3824 11.1908 0.2126 1.1228 97.6045 1.6698 10.1912 9.6903 10.9442 6.0312 7.6271 6.8181 3.4831 2.0836 1.6110 0.5717 1.9670 1.7294 0.4801 0.3047 4.3848 29.9615 0.0237 13.0824 0.3195 8.1656 18.9036 42.1601 15.4502 3.6239 3.5431 0.7455 1.2337 22.8551 91.1491 7.4671 30.9554 24.3622 82.7888 65.9682 39.4266 12.2151 23.2699 6.9836 1.5495 4.1701 15.6122 12.2815 59.2793 69.4283 2.5316 14.9073 3.9510 1.2403 2.0286 54.7921 62.9463 7.1091
temp: 298.150 k
press: 1.00000 atm
elementType: 8 8 7 6 6 6 6 6 6 6 6 6 6 6 6 6 6 6 6 6 6 6 6 6 6 1 1 1 1 1 1 1 1 1 1 1 1 1 1 1 1 1 1 1 1 1 1 1
symmnumber: 1
zpe: 1045533.0 jmol-1
zpe.correction: 0.398223 hartree
zpe.thermalcorrener: 0.417708 hartree
zpe.thermalcorrenthalpy: 0.418652 hartree
zpe.thermalcorrgfe: 0.348924 hartree
zpe.sumelectzpe: -1055.547766 hartree
zpe.sumelectthermal: -1055.528280 hartree
zpe.sumelectthermalent: -1055.527336 hartree
zpe.sumelectthermalfe: -1055.597065 hartree
dipole: -0.3752 0.9875 0.0713
dipole: 1.0588
quadrupole: -140.4357 -137.0758 -147.2871
quadrupole: -4.8104 -0.2970 1.4274
quadrupole: 1.1638 4.5237 -5.6876 -4.8104 -0.2970 1.4274
hfenergy: -1055.9459887 hartree
pointgroup: C01 [X(C22H23N1O2)]
dipole: -0.0485658 0.4025668 -0.0953719 debye
polarizability: 256.7235253|-5.4988306|259.758771|30.2491842|-22.8923501|189.6706059 unknown
InChI: InChI=1S/C22H23NO2/c24-22(25-20-14-23-11-9-15(20)10-12-23)21-18-7-3-1-5-16(18)13-17-6-2-4-8-19(17)21/h1-8,15,20-21H,9-14H2
charge 0 multiplicity 1
48 atoms
O  -1.512637 -0.585473 -0.298103
O  -0.162035 -0.260052 1.580637
N  -4.999471 -0.022515 -0.56821
C  -3.019743 1.210891 0.593069
C  -2.743145 -0.309691 0.523204
C  -4.322662 1.395981 1.42305
C  -3.236893 1.781072 -0.834493
C  -3.943125 -1.005139 -0.192303
C  -5.494118 0.663782 0.665786
C  -4.42269 0.993594 -1.503703
C  0.866251 -0.762881 -0.635571
C  -0.284027 -0.510965 0.360253
C  1.817389 -1.829107 -0.094454
C  1.586289 0.567185 -0.882656
C  2.886029 -1.443664 0.756459
C  2.652762 0.94882 -0.025748
C  3.065371 0.025463 1.112368
C  1.635073 -3.191178 -0.428662
C  1.187414 1.418623 -1.939516
C  3.760173 -2.437471 1.256358
C  3.307923 2.182358 -0.252611
C  2.505976 -4.178846 0.081939
C  1.840418 2.652512 -2.152723
C  3.572712 -3.799087 0.928948
C  2.904881 3.035607 -1.304264
H  -2.174863 1.717202 1.090462
H  -2.551458 -0.705358 1.537238
H  -4.530886 2.476595 1.532435
H  -4.188129 0.986664 2.442809
H  -2.308614 1.681145 -1.424421
H  -3.465871 2.860566 -0.759327
H  -3.580295 -1.506648 -1.107006
H  -4.396951 -1.772003 0.460148
H  -5.970459 -0.097416 1.310043
H  -6.279424 1.378196 0.360742
H  -5.238607 1.675075 -1.80473
H  -4.083476 0.45948 -2.40938
H  0.399516 -1.110707 -1.572618
H  2.42625 0.247123 1.992224
H  4.109283 0.22693 1.41411
H  0.809386 -3.47878 -1.091027
H  0.366633 1.111866 -2.599413
H  4.592707 -2.142748 1.90667
H  4.139578 2.476045 0.399308
H  2.358442 -5.231817 -0.182046
H  1.52757 3.305346 -2.974974
H  4.257278 -4.557454 1.325146
H  3.421575 3.988382 -1.465253
