program: Gaussian 09
title: 000207082
version: EM64L-G09RevD.01
frameworkgroup: C1[X(C21H21NO3)]
method: RPBEPBE
basis: SDD
operation: Freq
keyword: #p
keyword: freq=noraman
keyword: PBEPBE/SDD
title: #p freq=noraman PBEPBE/SDD
converged: YES YES NO NO
title: Mulliken charges:
elementType: O O O N C C C C C C C C C C C C C C C C C C C C C H H H H H H H H H H H H H H H H H H H H H
charge: -0.297779 -0.209326 -0.272657 0.001856 -0.175328 -0.011402 -0.464655 -0.438571 -0.529971 -0.440904 -0.447663 0.265794 -0.476355 0.341248 0.358071 0.134085 0.128002 -0.380315 -0.390678 -0.361165 -0.361112 -0.254625 -0.253629 -0.221183 -0.218644 0.264511 0.261729 0.212815 0.221720 0.219658 0.209523 0.248087 0.238620 0.227831 0.229674 0.226214 0.231539 0.271601 0.236458 0.237888 0.258850 0.258145 0.229634 0.228556 0.232176 0.231678
chargesum: 0.00000
title: Mulliken charges with hydrogens summed into heavy atoms:
elementType: O O O N C C C C C C C C C C C C C C C C C C C C C
charge: -0.297779 -0.209326 -0.272657 0.001856 0.089183 0.250327 -0.030120 -0.009391 -0.043264 0.016601 0.010090 0.265794 -0.204754 0.341248 0.358071 0.134085 0.128002 -0.143857 -0.152789 -0.102315 -0.102967 -0.024992 -0.025073 0.010993 0.013034
polarizability: 2.66922671e+02 -1.96364949e+01 2.72730796e+02 2.87783766e+01 7.03894306e+00 1.60739095e+02
1716.lowfreq: -28.1453 -9.1449 -3.8573 -0.0007 0.0002 0.0004 3.7391 19.6554 27.6794
frequency: -24.7715 18.2371 27.6502 32.7256 54.5163 72.5837 96.1659 120.0814 133.4496 175.3341 206.3130 227.1871 256.1785 263.7263 278.0491 311.6235 335.0518 367.2132 391.1695 392.4049 397.0283 447.2435 456.5353 470.8955 518.5776 528.8432 532.9531 538.0882 572.4515 599.5868 601.8765 610.7885 652.8292 678.5615 688.1410 717.8270 734.0395 744.5352 759.1757 763.3649 768.0553 778.4508 801.3774 805.5578 829.0909 832.1155 853.8142 866.0080 871.5619 873.7818 890.0974 893.8942 931.8320 939.0377 946.3711 949.4017 956.8552 980.3717 981.1893 987.7216 997.0861 1026.6330 1030.3026 1031.5571 1055.1764 1074.4890 1084.2945 1089.1273 1102.6376 1107.8406 1131.3687 1167.3244 1167.9456 1168.5310 1169.6922 1191.2100 1200.5892 1211.6580 1213.5525 1216.6841 1228.6668 1241.9234 1262.1294 1269.8480 1283.2587 1296.3687 1303.6942 1306.4222 1310.6326 1312.7587 1314.0979 1317.3227 1329.0589 1356.1417 1360.5869 1388.0336 1392.5685 1440.4378 1447.0897 1447.6838 1458.0679 1466.0558 1467.3419 1473.0201 1479.2741 1483.6430 1583.1187 1604.6473 1608.8636 1629.0219 1642.8661 2984.6452 2992.4265 3002.1842 3003.8810 3007.0586 3030.0961 3030.8636 3039.9687 3046.9419 3053.7085 3066.5251 3074.0682 3074.8424 3120.7096 3124.0529 3140.1253 3140.5381 3158.9918 3159.2765 3173.6009 3174.0187
redmass: 3.7657 5.0780 3.3459 4.5537 5.3677 5.0697 5.5973 3.2451 4.0933 4.2870 4.0003 5.0999 3.8173 3.4320 3.3984 5.1683 3.2448 6.0946 2.7048 3.8130 2.2029 3.8093 3.2730 4.4346 5.9206 4.1416 4.5182 4.2908 4.7017 7.0219 6.1539 5.6692 6.0479 5.9523 4.9654 4.9096 4.3123 4.6265 1.7268 1.2767 2.2407 2.0471 1.9731 1.6305 3.0732 2.9406 1.9660 1.5198 2.9820 2.9630 3.1824 5.2308 3.3932 2.0782 1.3983 1.5111 3.2950 1.3114 1.3154 2.4324 2.8887 2.8780 2.2301 2.0305 2.8673 2.3812 3.7870 2.2388 1.7087 2.1302 1.4100 1.1175 1.3367 1.1837 1.8291 1.9802 1.2795 1.4659 2.2689 1.3640 1.2578 3.0718 1.5134 1.4469 1.4322 1.2920 1.3357 1.4144 1.3095 1.3162 1.3854 1.7002 1.3030 1.3648 1.4780 7.2004 10.1711 2.4258 1.0778 2.5240 1.0795 1.0885 1.0820 2.5693 1.0964 2.7160 6.5782 7.5820 7.0447 7.7453 9.4479 1.0594 1.0590 1.0600 1.0606 1.0629 1.0858 1.0850 1.1030 1.1035 1.0880 1.1054 1.1051 1.1055 1.0885 1.0878 1.0885 1.0888 1.0943 1.0944 1.0995 1.0995
irintensity: 0.2759 0.6104 0.1449 0.2000 0.5529 1.9354 1.1215 1.2971 0.2395 2.7470 2.0427 2.6636 2.6119 0.1435 1.8423 0.7398 3.1292 0.3211 0.4192 0.3824 2.5537 5.7757 1.7854 1.7251 1.4312 4.2619 1.7716 1.9925 3.9375 8.9741 1.4954 5.0861 9.8102 6.9217 12.6681 3.1095 1.1398 12.4505 150.1483 2.5474 24.2526 22.4615 10.8439 4.7005 27.0647 6.5404 3.0459 1.7554 0.9902 0.5692 1.5030 18.1133 49.7333 10.1875 0.1725 3.1320 44.5732 0.0525 0.2552 24.0916 39.9866 14.8312 1.6873 11.8596 11.4575 2.8729 405.5498 28.7146 0.6676 33.9039 0.5671 3.7203 0.3530 1.7231 2.7642 81.5054 4.8191 15.2285 21.5184 4.2252 0.2367 244.3441 94.5383 0.5435 0.1470 3.7130 4.5033 8.4343 2.0110 3.6462 1.3516 5.3996 1.6976 2.2899 1.9853 4.5645 1.2072 84.3996 13.0298 12.1415 0.3026 9.5230 15.1333 159.4712 13.1746 6.2494 43.4179 5.3381 14.3853 33.6483 96.0728 30.4825 25.4811 73.2460 73.8514 40.0916 9.9966 5.7490 6.8447 2.5657 15.7436 5.9463 53.9726 82.0814 4.8550 5.9912 8.0782 12.5424 28.6988 11.2080 23.7608 6.7806
temp: 298.150 k
press: 1.00000 atm
elementType: 8 8 8 7 6 6 6 6 6 6 6 6 6 6 6 6 6 6 6 6 6 6 6 6 6 1 1 1 1 1 1 1 1 1 1 1 1 1 1 1 1 1 1 1 1 1
symmnumber: 1
zpe: 981239.6 jmol-1
zpe.correction: 0.373734 hartree
zpe.thermalcorrener: 0.393072 hartree
zpe.thermalcorrenthalpy: 0.394016 hartree
zpe.thermalcorrgfe: 0.324248 hartree
zpe.sumelectzpe: -1091.453903 hartree
zpe.sumelectthermal: -1091.434566 hartree
zpe.sumelectthermalent: -1091.433621 hartree
zpe.sumelectthermalfe: -1091.503390 hartree
dipole: -1.2728 0.6437 -0.9532
dipole: 1.7155
quadrupole: -140.7144 -130.8230 -151.1286
quadrupole: -6.9515 -4.4417 0.9472
quadrupole: 0.1743 10.0656 -10.2399 -6.9515 -4.4417 0.9472
hfenergy: -1091.8276376 hartree
pointgroup: C01 [X(C21H21N1O3)]
dipole: -0.4224808 0.2130207 -0.4813137 debye
polarizability: 257.9749336|-4.2420781|266.1381302|32.9034316|-40.8486775|176.2794976 unknown
InChI: InChI=1S/C21H21NO3/c23-21(25-19-13-22-11-9-14(19)10-12-22)20-15-5-1-3-7-17(15)24-18-8-4-2-6-16(18)20/h1-8,14,19-20H,9-13H2
charge 0 multiplicity 1
46 atoms
O  -1.513219 -0.55252 -0.315322
O  -0.265093 -0.218842 1.635384
O  3.424194 -0.025061 0.794333
N  -5.003742 -0.019793 -0.742807
C  -3.073243 1.259529 0.451212
C  -2.785682 -0.260056 0.433593
C  -4.405025 1.456816 1.231623
C  -3.246456 1.79013 -0.997338
C  -3.946797 -0.981896 -0.319002
C  -5.542461 0.684072 0.463121
C  -4.413165 0.986345 -1.680475
C  -0.323867 -0.484611 0.416748
C  0.881572 -0.773052 -0.509207
C  1.600249 0.547549 -0.785219
C  1.808694 -1.790061 0.144583
C  2.791052 0.872842 -0.092804
C  2.991532 -1.371479 0.796833
C  1.069466 1.50332 -1.683656
C  1.487263 -3.167583 0.170911
C  3.429168 2.119669 -0.264711
C  3.824126 -2.282069 1.480694
C  1.695927 2.752813 -1.874578
C  2.308726 -4.096725 0.843382
C  2.875287 3.062507 -1.153497
C  3.476349 -3.647342 1.507523
H  -2.249693 1.785642 0.963768
H  -2.643623 -0.626344 1.466712
H  -4.628638 2.538033 1.295418
H  -4.299356 1.085582 2.268957
H  -2.300891 1.67189 -1.55617
H  -3.474027 2.871813 -0.960036
H  -3.543562 -1.484996 -1.215882
H  -4.411485 -1.750758 0.323282
H  -6.019129 -0.07248 1.112525
H  -6.334344 1.37494 0.123079
H  -5.227021 1.658369 -2.007079
H  -4.053031 0.442375 -2.57214
H  0.46714 -1.176789 -1.449691
H  0.150202 1.259817 -2.230249
H  0.57491 -3.508324 -0.33416
H  4.347212 2.324081 0.294035
H  4.726965 -1.907291 1.971725
H  1.269725 3.47991 -2.573394
H  2.041705 -5.158449 0.855314
H  3.366131 4.032153 -1.289263
H  4.117258 -4.359472 2.038231
