program: Gaussian 09
title: 000207067
version: EM64L-G09RevD.01
frameworkgroup: C1[X(C20H12Cl4N2O3)]
method: RPBEPBE
basis: SDD
operation: Freq
keyword: #p
keyword: freq=noraman
keyword: PBEPBE/SDD
title: #p freq=noraman PBEPBE/SDD
converged: YES YES NO NO
title: Mulliken charges:
elementType: Cl Cl Cl Cl O O O N N C C C C C C C C C C C C C C C C C C C C H H H H H H H H H H H H
charge: -0.027573 -0.012427 -0.017868 -0.013762 -0.501546 -0.281330 -0.269285 -0.485217 -0.476324 0.064708 0.288016 -0.408090 0.259276 -0.333804 0.136314 0.127807 -0.392387 0.630806 0.644291 -0.366470 -0.342654 -0.368134 -0.343270 -0.065521 -0.207368 -0.066879 -0.204964 -0.255507 -0.254661 0.261278 0.285060 0.229476 0.407016 0.327506 0.322790 0.320365 0.238250 0.238096 0.261846 0.261946 0.390197
chargesum: 0.00000
title: Mulliken charges with hydrogens summed into heavy atoms:
elementType: Cl Cl Cl Cl O O O N N C C C C C C C C C C C C C C C C C C C C
charge: -0.027573 -0.012427 -0.017868 -0.013762 -0.111349 -0.281330 -0.269285 -0.078201 -0.148818 0.064708 0.288016 -0.146812 0.259276 -0.048745 0.136314 0.127807 -0.162911 0.630806 0.644291 -0.366470 -0.019864 -0.368134 -0.022906 -0.065521 0.030882 -0.066879 0.033132 0.006339 0.007284
polarizability: 4.96795670e+02 5.72778243e+00 3.48369851e+02 9.00662229e+00 -2.48148920e+00 1.02572283e+02
1716.lowfreq: -3.2870 0.0014 0.0017 0.0020 1.3550 2.5516 6.4774 13.9782 25.7982
frequency: 6.2301 13.9538 25.7763 33.1966 36.0937 59.7188 67.1718 69.1585 99.2242 117.0552 120.1795 134.0547 160.6350 187.2583 195.3412 202.7384 208.7393 212.2931 213.4560 221.6264 269.5126 290.1531 294.7049 323.9200 333.8185 348.3560 354.9132 359.2734 388.3883 419.2993 426.4267 431.2195 445.0035 470.4745 474.5116 498.1782 499.4039 527.8261 540.4253 555.7249 563.0134 569.1198 600.0253 650.5709 665.7070 682.3294 701.2167 709.2089 713.8882 714.9893 720.4743 744.3473 764.0038 790.6523 791.2631 810.8675 832.1165 852.0267 856.5256 862.8715 865.7728 911.2632 911.7007 934.5950 947.5224 987.3120 992.1967 993.4195 1007.2351 1009.5514 1067.8706 1084.0390 1088.5967 1101.6143 1121.1806 1154.6799 1157.3996 1160.4967 1195.6563 1198.3551 1220.4421 1243.3160 1265.2673 1285.4342 1303.7601 1315.5798 1355.8915 1357.4994 1395.6289 1401.4478 1407.4901 1413.3209 1443.8920 1446.3513 1482.7661 1517.8140 1531.7573 1565.1088 1569.1801 1581.0862 1590.2166 1597.4541 1601.5773 1617.6135 1634.4475 3121.7940 3124.8493 3153.3024 3153.6039 3169.6645 3179.4131 3180.0470 3198.8209 3199.5009 3327.2874 3493.4777 3605.6080
redmass: 8.3518 10.5164 12.5219 11.6528 7.9081 10.3221 13.2552 12.5527 7.9527 6.7604 10.3446 6.9309 5.3630 11.3042 24.7818 19.5628 5.0735 6.9810 5.9530 10.1567 5.8839 10.4729 5.7115 8.9581 5.6454 11.5754 11.2585 1.1480 7.5493 8.2543 8.7355 3.3893 9.0359 8.2418 8.4135 4.4086 4.4123 4.2878 4.9355 4.1297 4.6871 8.1731 6.6148 7.7442 4.2113 1.6179 7.3377 7.5224 3.3147 7.5760 2.8696 4.4053 3.8146 1.4401 1.4637 7.2323 1.5384 1.2158 6.3230 6.4019 7.3078 1.3593 1.3615 6.1018 1.5323 1.3544 1.3120 1.3116 7.0628 6.8978 2.6256 2.3905 1.8731 2.1126 2.0634 1.4715 1.5362 1.2796 1.4294 1.4168 2.4817 3.2363 3.4259 1.5006 2.3023 1.9506 6.2065 6.0131 4.6930 8.3178 3.6685 3.6281 2.6570 2.8145 2.8406 2.5336 3.0038 8.2333 6.7429 4.1825 3.7530 7.1880 5.2274 5.0790 3.4962 1.0908 1.0905 1.0887 1.0886 1.0948 1.0957 1.0957 1.0955 1.0953 1.0802 1.0756 1.0666
irintensity: 0.2692 0.0117 0.0351 0.0717 5.3183 5.8420 0.6056 1.4096 3.4181 0.9022 6.1729 0.5082 0.0524 2.7288 0.1072 1.0736 0.1166 0.8452 1.1724 5.2177 4.5208 10.3111 7.4952 6.1327 2.4376 2.6830 6.6111 140.2024 3.3862 1.9479 8.8787 0.6374 7.1132 1.0331 5.0896 0.2804 0.0164 9.8929 0.6900 4.2352 10.1173 83.6875 19.4862 7.5535 0.2412 58.1081 21.3131 8.6311 14.9359 7.1708 0.8793 30.4672 6.1256 42.5644 105.3466 6.5014 16.2895 112.3008 7.8093 48.8819 15.0323 4.4843 6.0002 0.4700 14.0795 1.5057 6.0104 6.0464 34.8366 57.0033 104.0518 18.4102 17.0953 60.5425 110.2588 35.1105 3.2083 4.1893 35.1893 7.1920 128.9908 116.8637 130.5759 36.0505 143.7360 39.9579 165.7920 134.6113 32.0136 5.1313 48.2586 115.1847 66.3531 48.0664 308.9137 340.5847 390.0381 209.7038 156.1400 49.6133 97.6191 211.7660 108.1467 135.8931 81.3198 17.1747 9.5693 7.7380 8.8683 4.2744 2.8584 2.5173 13.8224 15.8669 141.8088 35.7676 98.0543
temp: 298.150 k
press: 1.00000 atm
elementType: 17 17 17 17 8 8 8 7 7 6 6 6 6 6 6 6 6 6 6 6 6 6 6 6 6 6 6 6 6 1 1 1 1 1 1 1 1 1 1 1 1
symmnumber: 1
zpe: 724774.4 jmol-1
zpe.correction: 0.276052 hartree
zpe.thermalcorrener: 0.302148 hartree
zpe.thermalcorrenthalpy: 0.303092 hartree
zpe.thermalcorrgfe: 0.214896 hartree
zpe.sumelectzpe: -2942.767585 hartree
zpe.sumelectthermal: -2942.741489 hartree
zpe.sumelectthermalent: -2942.740545 hartree
zpe.sumelectthermalfe: -2942.828741 hartree
dipole: -0.7676 3.5352 -0.2196
dipole: 3.6243
quadrupole: -197.6064 -173.9345 -200.1874
quadrupole: -1.0392 0.7890 -2.6364
quadrupole: -7.0303 16.6416 -9.6113 -1.0392 0.7890 -2.6364
hfenergy: -2943.0436371 hartree
pointgroup: C01 [X(C20H12Cl4N2O3)]
dipole: 0.1210596 1.2875166 0.6006806 debye
polarizability: 487.6173194|-9.7010467|315.5450422|57.8938266|83.0534151|144.5754422 unknown
InChI: InChI=1S/C20H12Cl4N2O3/c21-12-3-1-5-14(17(12)23)25-19(28)10-7-8-16(27)11(9-10)20(29)26-15-6-2-4-13(22)18(15)24/h1-9,25-27H
charge 0 multiplicity 1
41 atoms
Cl 5.930961 1.430758 1.391064
Cl -3.120254 -2.405956 -1.193694
Cl 8.474183 -0.526318 0.896901
Cl -6.013985 -3.561917 -2.143741
O  2.687975 2.698685 1.39345
O  1.536201 -0.941959 -0.49561
O  -3.641363 2.700511 0.211752
N  3.319766 0.310983 0.38841
N  -3.181255 0.472196 -0.369866
C  1.019126 1.219913 0.44093
C  -1.355105 1.928616 0.397014
C  -0.340333 0.986708 0.117671
C  1.343826 2.45683 1.066401
C  -0.992804 3.155502 1.01389
C  1.978572 0.107808 0.071859
C  -2.815605 1.744784 0.073068
C  0.343929 3.417568 1.347536
C  4.397268 -0.573277 0.152404
C  -4.460385 0.022396 -0.77037
C  5.706132 -0.181717 0.572134
C  4.250412 -1.838678 -0.484118
C  -4.596696 -1.334729 -1.19382
C  -5.617481 0.849578 -0.774588
C  6.814241 -1.023621 0.361727
C  5.371366 -2.666371 -0.686005
C  -5.8432 -1.839789 -1.605998
C  -6.856477 0.325667 -1.191746
C  6.66115 -2.27446 -0.269242
C  -6.987106 -1.01591 -1.609812
H  -0.523341 0.025815 -0.379463
H  -1.783261 3.885193 1.21418
H  0.615469 4.366813 1.826255
H  3.541859 1.209824 0.848601
H  -2.449213 -0.24313 -0.410714
H  3.252999 -2.140769 -0.804978
H  -5.514014 1.885004 -0.447916
H  5.238456 -3.635316 -1.177319
H  -7.738355 0.973904 -1.190551
H  7.532824 -2.91533 -0.424658
H  -7.948824 -1.423286 -1.932234
H  2.827742 3.577476 1.821298
